program: Gaussian 09
title: 000235916
version: EM64L-G09RevD.01
frameworkgroup: C1[X(C15H8Br2Cl2N2O2)]
method: RPBEPBE
basis: SDD
operation: Freq
keyword: #p
keyword: freq=noraman
keyword: PBEPBE/SDD
title: #p freq=noraman PBEPBE/SDD
converged: YES YES NO NO
title: Mulliken charges:
elementType: Br Br Cl Cl O O N N C C C C C C C C C C C C C C C H H H H H H H H
charge: 0.239313 0.270906 -0.035375 -0.038719 -0.158347 -0.175945 -0.562261 -0.552427 -0.036045 0.481914 0.398665 0.239963 0.332925 -0.360289 -0.317273 -0.353193 -0.369367 -0.219722 -0.222239 -0.215558 -0.210781 -0.126336 -0.124539 0.271982 0.274419 0.248992 0.271413 0.262445 0.261574 0.262168 0.261737
chargesum: 0.00000
title: Mulliken charges with hydrogens summed into heavy atoms:
elementType: Br Br Cl Cl O O N N C C C C C C C C C C C C C C C
charge: 0.239313 0.270906 -0.035375 -0.038719 -0.158347 -0.175945 -0.562261 -0.552427 -0.036045 0.481914 0.398665 0.239963 0.332925 -0.088307 -0.042854 -0.104202 -0.097954 0.042723 0.039335 0.046610 0.050956 -0.126336 -0.124539
polarizability: 2.63258589e+02 5.18551365e+00 2.79180966e+02 -7.14774321e+00 -2.26368314e+00 1.94969291e+02
1716.lowfreq: -5.3474 -3.0572 -1.3858 -0.0012 0.0013 0.0016 22.2973 29.3831 33.4941
frequency: 22.2885 29.3673 33.4782 38.9371 47.6534 69.6482 75.2486 103.2819 116.1917 120.6160 145.1601 171.0047 191.3916 192.8426 213.7008 214.7206 233.6469 267.1300 288.3561 318.0278 325.7035 341.0387 368.9273 405.4901 412.0356 429.4985 455.2400 499.9117 512.4954 534.9350 618.2347 623.0405 630.9345 640.1345 670.5910 689.2641 706.2121 708.5901 723.6864 745.4341 796.6002 829.2147 833.1126 836.7497 846.0268 901.8012 936.6289 957.1195 967.5870 971.9846 978.0209 1001.0229 1001.7720 1037.6190 1063.0889 1076.5207 1077.2964 1119.4535 1121.0547 1146.7652 1172.1077 1193.8994 1197.3161 1217.2414 1228.4854 1299.8214 1303.7434 1362.2837 1371.8679 1394.0386 1398.2132 1475.1508 1477.8562 1579.8798 1584.1647 1595.9954 1597.5897 1675.0463 1722.4962 3139.6820 3152.3406 3154.5980 3158.6543 3173.4032 3175.0780 3176.3746 3178.9396
redmass: 24.8529 10.8498 6.7083 7.9740 14.9840 5.6790 9.2629 17.8727 11.5223 11.3368 10.5844 12.1015 15.9827 15.2200 19.5341 10.9606 11.1305 15.6043 10.7628 6.5772 6.1074 6.0773 5.8516 2.8898 2.9429 8.2532 8.2998 4.2751 3.8023 5.7959 7.4823 7.1960 9.7402 9.6586 11.4732 6.0504 6.5267 7.3421 4.5606 4.6218 3.6830 1.3889 1.4431 1.2568 2.0047 6.9142 3.4218 1.3826 1.6533 1.3716 1.3957 4.2934 4.1076 10.3361 10.7851 2.7428 2.8375 1.4039 1.3983 8.9376 4.5017 1.1361 1.1389 4.4625 8.5972 1.2621 1.2730 6.0469 6.9762 3.5203 3.1611 2.2823 2.2814 7.4263 7.6592 6.0632 6.1208 12.9972 12.9330 1.0901 1.0889 1.0891 1.0884 1.0956 1.0963 1.0967 1.0974
irintensity: 0.0292 0.0595 0.0714 0.1211 0.2883 0.4833 0.9677 0.0196 1.7023 0.3965 2.4021 2.2547 0.6309 0.2748 0.3400 1.3330 2.4461 1.6733 0.2774 1.2266 2.7726 0.8558 2.1234 0.0589 0.1585 34.1701 14.1768 20.1410 23.2241 5.4960 0.6676 2.9993 55.4426 51.3648 18.9356 12.8297 13.1329 13.0500 5.3568 21.2341 78.4577 18.6314 16.6412 1.7710 8.6866 38.8975 31.4870 1.0723 2.2544 1.1028 2.3885 37.1305 56.0134 26.9055 46.6527 60.9399 57.8539 13.3019 2.5182 29.9091 11.0580 6.9429 0.5761 46.2683 76.1626 1.5527 0.6999 4.0546 1.8746 12.5933 11.3620 65.1787 83.2719 3.2171 8.5874 49.7421 32.3908 478.0170 194.2701 4.7192 4.0371 1.9241 0.8066 2.9480 2.4620 0.2373 0.6401
temp: 298.150 k
press: 1.00000 atm
elementType: 35 35 17 17 8 8 7 7 6 6 6 6 6 6 6 6 6 6 6 6 6 6 6 1 1 1 1 1 1 1 1
symmnumber: 1
zpe: 511940.7 jmol-1
zpe.correction: 0.194988 hartree
zpe.thermalcorrener: 0.216323 hartree
zpe.thermalcorrenthalpy: 0.217268 hartree
zpe.thermalcorrgfe: 0.140338 hartree
zpe.sumelectzpe: -1781.742520 hartree
zpe.sumelectthermal: -1781.721184 hartree
zpe.sumelectthermalent: -1781.720240 hartree
zpe.sumelectthermalfe: -1781.797169 hartree
dipole: 0.5448 -1.6400 0.2367
dipole: 1.7443
quadrupole: -170.8108 -164.6468 -167.3261
quadrupole: -0.8322 -3.6387 -9.6167
quadrupole: -3.2163 2.9478 0.2685 -0.8322 -3.6387 -9.6167
hfenergy: -1781.9375077 hartree
pointgroup: C01 [X(C15H8Br2Cl2N2O2)]
dipole: 0.1300748 -0.648378 0.183377 debye
polarizability: 265.3015216|6.4698929|276.1183972|-4.6153158|-11.447303|195.988927 unknown
InChI: InChI=1S/C15H8Br2Cl2N2O2/c16-20-13(22)15(21(17)14(20)23,9-1-5-11(18)6-2-9)10-3-7-12(19)8-4-10/h1-8H
charge 0 multiplicity 1
31 atoms
Br 0.500578 0.838625 3.024245
Br -0.21748 4.389652 -1.530534
Cl 5.233303 -2.814501 -0.108652
Cl -5.273792 -2.75101 -0.226482
O  -0.189325 1.183355 -2.346985
O  0.194993 3.740773 1.621049
N  0.060496 1.384924 1.222675
N  -0.060775 2.742284 -0.557382
C  -0.004932 0.443255 0.065921
C  1.280811 -0.393681 -0.050157
C  -1.305183 -0.374842 0.044087
C  -0.097797 1.481594 -1.142781
C  0.085827 2.740681 0.895418
C  1.336026 -1.693753 0.510749
C  -1.483394 -1.363292 -0.958723
C  2.455396 0.158476 -0.62094
C  -2.361951 -0.106186 0.946055
C  2.535679 -2.436387 0.498719
C  -2.6890 -2.087489 -1.047498
C  3.660565 -0.572347 -0.644935
C  -3.572602 -0.830146 0.873157
C  3.682909 -1.863393 -0.081729
C  -3.716823 -1.813911 -0.122645
H  0.442284 -2.134782 0.962556
H  -0.688657 -1.555973 -1.686002
H  2.443056 1.161057 -1.062747
H  -2.248334 0.667344 1.711029
H  2.575981 -3.4384 0.934694
H  -2.828387 -2.844495 -1.824157
H  4.562912 -0.147713 -1.093394
H  -4.385685 -0.627215 1.575688
