program: Gaussian 09
title: 000235884
version: EM64L-G09RevD.01
frameworkgroup: C1[X(C14H11ClN2O)]
method: RPBEPBE
basis: SDD
operation: Freq
keyword: #p
keyword: freq=noraman
keyword: PBEPBE/SDD
title: #p freq=noraman PBEPBE/SDD
converged: YES YES NO NO
title: Mulliken charges:
elementType: Cl O N N C C C C C C C C C C C C C C H H H H H H H H H H H
charge: -0.056313 -0.464716 -0.408944 -0.026118 0.291258 0.118550 -0.274498 0.234354 -0.415355 0.155732 -0.396789 -0.351755 -0.257734 -0.213330 -0.281712 -0.129117 -0.387349 -0.040721 0.232063 0.284518 0.306109 0.259355 0.227569 0.221906 0.221782 0.276151 0.350734 0.261220 0.263152
chargesum: 0.00000
title: Mulliken charges with hydrogens summed into heavy atoms:
elementType: Cl O N N C C C C C C C C C C C C C C
charge: -0.056313 -0.113982 -0.102836 -0.026118 0.291258 0.118550 -0.042436 0.234354 -0.130837 0.155732 -0.137434 -0.124186 -0.035827 0.008452 -0.005560 0.132103 -0.124197 -0.040721
polarizability: 2.17111459e+02 7.50497252e+00 1.86293543e+02 1.24286189e+00 -2.33665497e+01 1.19134071e+02
1716.lowfreq: -6.3526 -4.5633 -0.0019 0.0006 0.0010 9.9141 19.4441 35.7914 40.1155
frequency: 19.3160 35.7823 39.9729 98.4251 137.3605 163.5088 173.2642 218.9873 259.3215 285.8095 305.3024 318.6862 362.0080 397.4428 413.3567 421.8524 454.2160 470.3738 515.4097 521.9647 557.9958 575.6848 613.5919 615.2716 628.9823 678.8842 727.8047 751.0755 757.1359 762.9134 796.7855 809.1125 822.6015 852.2289 865.9699 868.4124 908.3626 935.5473 972.9097 975.1995 980.7143 981.0822 1012.3585 1053.1459 1083.8771 1094.3038 1118.4790 1131.6686 1157.9502 1167.9957 1220.3917 1236.4939 1242.8829 1278.8891 1281.6880 1294.0754 1319.1949 1351.8343 1355.5960 1359.4608 1389.8497 1421.4453 1446.3696 1458.3271 1484.3223 1551.6499 1555.0990 1566.5308 1586.8536 1631.7313 2965.5016 3125.6950 3137.2406 3152.1416 3152.3935 3163.0632 3166.3591 3186.3062 3230.9808 3562.6498 3611.4144
redmass: 5.5057 7.3287 4.9591 6.8306 5.5367 6.4670 6.9489 4.0411 4.7930 5.2998 6.5429 6.6241 1.2322 4.5313 4.1195 2.9942 4.9254 5.1479 2.7287 1.5356 5.1826 2.9074 7.2533 5.7218 4.2785 4.6109 5.2052 1.3654 4.1316 4.7550 1.9900 2.7315 2.0163 1.4514 2.0652 4.9010 1.4052 1.3809 4.5930 1.4250 1.8127 2.8052 2.1069 4.1198 2.6913 1.5802 1.3156 1.4060 1.3292 1.0935 2.0604 2.3291 1.6268 1.5036 1.4914 2.0741 4.4309 1.7792 2.6933 1.7019 5.0881 2.4194 2.4408 4.1048 3.0463 5.9456 7.2480 6.4533 6.2176 6.9872 1.0839 1.0853 1.0897 1.0935 1.0946 1.0906 1.0999 1.0969 1.0980 1.0657 1.0809
irintensity: 0.0410 0.4078 3.0595 0.1953 1.3770 0.0675 2.2361 13.3227 14.9822 2.5284 1.7976 2.7276 171.7076 10.4920 1.8608 14.6717 6.4637 13.2859 27.6468 68.9091 8.0145 14.4129 5.8951 2.1296 2.9326 7.7922 11.7658 109.8917 4.4511 2.7324 42.2265 36.2787 19.7662 4.0854 10.1258 1.7890 4.0621 4.8284 70.0170 10.9114 15.5555 36.2930 12.3203 9.6459 44.2661 33.7501 3.5516 5.2519 60.7980 4.1561 4.7232 22.2728 4.9606 0.7410 8.7581 0.5857 1.5217 23.0755 16.5117 27.4053 40.8625 4.1232 108.3528 21.1825 1.1399 23.3523 4.1712 7.4867 0.5134 2.2745 20.3288 0.3538 14.4112 17.0220 16.6914 1.5745 22.0006 1.4106 0.0163 5.5988 63.8471
temp: 298.150 k
press: 1.00000 atm
elementType: 17 8 7 7 6 6 6 6 6 6 6 6 6 6 6 6 6 6 1 1 1 1 1 1 1 1 1 1 1
symmnumber: 1
zpe: 570360.5 jmol-1
zpe.correction: 0.217239 hartree
zpe.thermalcorrener: 0.232097 hartree
zpe.thermalcorrenthalpy: 0.233041 hartree
zpe.thermalcorrgfe: 0.173246 hartree
zpe.sumelectzpe: -1183.619928 hartree
zpe.sumelectthermal: -1183.605070 hartree
zpe.sumelectthermalent: -1183.604125 hartree
zpe.sumelectthermalfe: -1183.663920 hartree
dipole: -2.8830 2.5101 -2.0989
dipole: 4.3609
quadrupole: -106.4322 -102.3532 -106.0761
quadrupole: -2.3022 6.7158 -7.7598
quadrupole: -1.4784 2.6007 -1.1223 -2.3022 6.7158 -7.7598
hfenergy: -1183.8371665 hartree
pointgroup: C01 [X(C14H11Cl1N2O1)]
dipole: -0.9381972 1.3633934 -0.4523021 debye
polarizability: 218.748635|2.6876952|192.0765868|1.3384166|0.6824153|111.7138515 unknown
InChI: InChI=1S/C14H11ClN2O/c15-9-5-6-13(16-7-9)14(18)11-8-17-12-4-2-1-3-10(11)12/h1-8,14,17-18H
charge 0 multiplicity 1
29 atoms
Cl 4.95096 -2.004828 -1.263701
O  0.762088 2.245104 1.88591
N  -2.387436 1.909243 -0.977032
N  1.506495 -1.108594 0.735558
C  -0.868205 1.037125 0.485413
C  -1.85937 0.016619 0.191889
C  0.318948 0.917833 1.420185
C  -2.806496 0.595872 -0.725169
C  -1.219435 2.172049 -0.249066
C  1.52653 0.258298 0.757085
C  -2.032131 -1.331462 0.605845
C  -3.919122 -0.121979 -1.217361
C  -3.141491 -2.049711 0.120842
C  -4.075674 -1.451992 -0.777681
C  2.580666 1.015831 0.194293
C  3.648214 0.337756 -0.432892
C  2.530851 -1.765446 0.123333
C  3.60564 -1.070085 -0.467537
H  0.036159 0.275367 2.280568
H  -0.714799 3.133649 -0.312872
H  -2.86512 2.574522 -1.580631
H  -1.296279 -1.805206 1.263406
H  -4.633927 0.328629 -1.915113
H  -3.29006 -3.090748 0.42826
H  -4.926369 -2.041003 -1.138478
H  2.560359 2.105222 0.272114
H  -0.032463 2.720962 2.237991
H  4.485706 0.883889 -0.876711
H  2.490563 -2.859314 0.115849
