program: Gaussian 09
title: 000235857
version: EM64L-G09RevD.01
frameworkgroup: C1[X(C18H22O3)]
method: RPBEPBE
basis: SDD
operation: Freq
keyword: #pfreq=noraman
keyword: PBEPBE/SDD
title: #p freq=noraman PBEPBE/SDD
converged: YES YES NO NO
title: Mulliken charges:
elementType: O O O C C C C C C C C C C C C C C C C C C H H H H H H H H H H H H H H H H H H H H H H
charge: -0.444427 -0.491665 -0.477376 -0.281487 -0.232991 -0.416666 -0.418814 0.724589 0.523028 -0.710203 -0.721393 -0.652500 -0.576412 -0.442757 -0.393498 0.207018 0.256952 -0.226667 -0.260320 -0.062769 -0.248797 0.205283 0.220793 0.213199 0.204669 0.209396 0.216024 0.240061 0.201089 0.213804 0.215515 0.245265 0.216972 0.220294 0.250547 0.228101 0.225108 0.223046 0.221320 0.225627 0.383257 0.371774 0.396011
chargesum: 0.00000
title: Mulliken charges with hydrogens summed into heavy atoms:
elementType: O O O C C C C C C C C C C C C C C C C C C
charge: -0.061170 -0.119892 -0.081365 -0.076204 -0.012198 0.001202 0.006606 0.724589 0.523028 -0.055248 -0.043641 -0.432206 -0.325865 -0.214656 -0.168390 0.207018 0.256952 -0.003621 -0.039000 -0.062769 -0.023170
polarizability: 2.01306982e+02 -1.50353131e+01 2.06379258e+02 1.09804033e+01 9.49629287e+00 1.89857134e+02
1716.lowfreq: -12.1847 -8.6390 -0.0010 -0.0003 0.0004 6.4953 13.8445 28.5642 35.1959
frequency: 12.2204 28.3914 35.1751 56.5991 78.5064 87.7889 113.2386 140.8155 156.6719 165.7763 186.4025 201.7037 221.0509 238.5264 246.6458 249.8898 256.5264 267.5442 283.5738 290.7539 313.6790 341.7638 368.7686 404.5660 407.8920 427.1618 467.3472 472.7696 514.5767 527.7983 544.2050 558.6848 583.5804 605.6071 618.8502 643.4029 653.8249 707.0637 714.7381 746.7993 754.0079 763.7747 802.9095 816.6046 823.1805 852.6755 856.3165 868.8488 897.7716 924.1732 960.3386 974.1373 976.9434 983.5154 990.1099 991.1913 1025.9665 1032.8180 1057.4140 1068.9096 1078.7597 1085.2017 1098.8137 1108.7095 1129.8366 1149.5089 1170.6320 1171.0731 1189.3679 1201.5881 1212.7298 1226.7685 1237.7806 1246.9391 1259.4887 1283.0530 1287.6024 1309.3137 1315.0185 1332.5193 1348.5372 1353.4130 1367.9290 1382.7866 1388.1588 1392.7108 1415.2267 1439.5915 1464.8300 1468.4199 1473.1545 1475.5494 1481.0555 1482.9640 1483.9548 1493.9687 1525.4086 1589.8968 1611.8701 1627.0352 1637.9850 2958.7903 2970.6325 2973.8974 2976.9740 2980.3728 2987.9973 3027.4480 3035.4244 3064.7600 3066.3058 3082.5691 3084.4099 3112.2514 3113.6523 3122.6821 3129.8931 3139.2421 3153.0871 3159.1046 3529.4792 3569.5525 3625.6508
redmass: 5.3795 5.6844 4.0009 3.4243 2.8940 3.4387 3.1600 3.3968 2.9491 3.2824 2.6896 1.8913 2.4451 1.4855 3.8110 1.3513 4.6376 2.0435 5.0414 3.6862 2.2338 4.0532 3.8659 1.1281 2.8229 3.3096 4.1049 1.1409 6.5894 3.8300 3.4188 4.6750 4.2037 4.1525 5.6976 4.5983 3.0778 1.6519 2.6814 2.6977 1.9616 1.8130 1.6946 1.7298 1.8417 1.2787 1.6693 2.2116 1.8812 1.7019 2.5717 1.4024 2.5681 3.3711 5.9507 1.3313 2.2595 1.7263 1.6458 1.9480 2.3300 2.0924 1.9599 1.7280 2.3528 1.5185 1.0822 1.3563 1.1192 1.8896 1.4184 1.5056 1.7174 1.5361 1.3734 1.5050 1.5121 1.3454 1.4704 1.4291 1.3943 1.3796 2.4686 5.2226 1.2187 1.2287 4.4955 2.1386 1.5801 1.6500 1.0484 1.1631 1.0577 1.6248 1.1820 1.0596 3.7515 5.9237 6.1512 7.0843 7.3461 1.0788 1.0718 1.0377 1.0478 1.0558 1.0695 1.1004 1.0970 1.0991 1.0989 1.0996 1.0996 1.0849 1.0876 1.0910 1.0910 1.0957 1.0915 1.1013 1.0651 1.0654 1.0665
irintensity: 1.5858 0.0065 0.7949 0.0740 0.0533 0.3703 0.4502 0.1595 1.4158 0.2543 0.3317 5.0656 29.7075 1.3557 0.1075 118.0628 5.2767 3.5308 14.8327 0.4721 0.2673 0.5822 1.0602 181.7892 0.1549 0.7509 10.0457 107.8639 0.4267 5.7143 9.3339 0.5039 13.8333 20.2145 2.6621 9.8203 4.7871 54.2151 9.8911 31.3898 22.3302 45.1668 20.8771 15.8771 1.0499 2.0714 8.6887 12.6962 0.1791 5.8991 6.5751 0.5470 35.9148 143.4713 1.0126 1.8233 7.7709 2.8941 15.1088 4.9492 14.7070 10.8637 6.7401 57.1131 3.0677 23.4119 11.3109 122.6368 0.8547 4.6622 82.4595 49.5555 81.5423 30.7143 5.5409 119.0632 95.1349 15.9719 1.6697 13.3459 2.7808 3.6658 38.5095 0.6907 12.1175 21.9562 1.8210 8.3749 1.3291 25.0565 9.2893 2.9480 5.2545 22.4623 0.9767 5.7531 114.5564 1.1800 6.9576 81.8848 25.5248 1.0382 23.4619 33.3691 12.3778 25.4052 68.0001 27.6553 32.1833 56.0386 52.1333 35.7926 66.2736 10.5546 1.2248 8.8808 13.6132 45.5391 3.0409 25.0949 76.7515 91.5028 46.0750
temp: 298.150 k
press: 1.00000 atm
elementType: 8 8 8 6 6 6 6 6 6 6 6 6 6 6 6 6 6 6 6 6 6 1 1 1 1 1 1 1 1 1 1 1 1 1 1 1 1 1 1 1 1 1 1
symmnumber: 1
zpe: 934437.9 jmol-1
zpe.correction: 0.355909 hartree
zpe.thermalcorrener: 0.377223 hartree
zpe.thermalcorrenthalpy: 0.378167 hartree
zpe.thermalcorrgfe: 0.304808 hartree
zpe.sumelectzpe: -923.217274 hartree
zpe.sumelectthermal: -923.195960 hartree
zpe.sumelectthermalent: -923.195016 hartree
zpe.sumelectthermalfe: -923.268375 hartree
dipole: -0.9677 -0.5739 -2.9005
dipole: 3.1110
quadrupole: -128.0131 -121.2669 -116.0943
quadrupole: -5.8773 -5.0588 2.8784
quadrupole: -6.2217 0.5246 5.6971 -5.8773 -5.0588 2.8784
hfenergy: -923.5731824 hartree
pointgroup: C01 [X(C18H22O3)]
dipole: -0.3457341 0.1850774 1.159454 debye
polarizability: 198.1682302|15.0214822|208.305137|-11.822607|8.2457993|191.0700059 unknown
InChI: InChI=1S/C18H22O3/c1-3-14(12-8-6-5-7-9-12)15(4-2)13-10-16(19)18(21)17(20)11-13/h5-11,14-15,19-21H,3-4H2,1-2H3
charge 0 multiplicity 1
43 atoms
O  3.316806 -0.054405 -2.453925
O  3.090908 1.423735 2.105044
O  4.350243 1.381602 -0.341124
C  -0.55383 -1.606226 0.296171
C  -1.678498 -0.986818 -0.612152
C  -0.32634 -3.119237 0.007136
C  -2.999324 -1.82757 -0.663112
C  0.748045 -0.809154 0.147619
C  -1.978834 0.476854 -0.266803
C  0.748158 -3.761441 0.910715
C  -3.704772 -2.085183 0.686528
C  1.27374 -0.080126 1.243655
C  1.441978 -0.796313 -1.089244
C  -2.060546 1.440326 -1.305334
C  -2.230229 0.912019 1.062162
C  2.636513 -0.063786 -1.230344
C  2.468218 0.653658 1.092001
C  -2.384247 2.788897 -1.034696
C  -2.556731 2.25801 1.340082
C  3.153728 0.666001 -0.136529
C  -2.636934 3.204465 0.292648
H  -0.87779 -1.526832 1.3546
H  -1.281504 -0.995665 -1.648793
H  -1.27979 -3.66209 0.147188
H  -0.042654 -3.253089 -1.056599
H  -2.781118 -2.796777 -1.152086
H  -3.702067 -1.29699 -1.335822
H  1.735743 -3.292788 0.755504
H  0.485838 -3.648456 1.980516
H  0.845437 -4.842413 0.700132
H  -3.052616 -2.626765 1.397249
H  -4.019567 -1.140073 1.162127
H  -4.610363 -2.700467 0.533103
H  0.74245 -0.078569 2.203553
H  1.074329 -1.352615 -1.957031
H  -1.856677 1.129368 -2.337925
H  -2.165168 0.198392 1.892125
H  -2.433943 3.513311 -1.855821
H  -2.749023 2.568758 2.373924
H  -2.887984 4.249349 0.507732
H  4.127232 0.513187 -2.365963
H  2.552043 1.437203 2.931261
H  4.593039 1.855615 0.494428
