program: Gaussian 09
title: 000020646
version: EM64L-G09RevD.01
frameworkgroup: C1[X(C8H18ClN)]
method: RPBEPBE
basis: SDD
operation: Freq
keyword: #p
keyword: freq=noraman
keyword: PBEPBE/SDD
title: #p freq=noraman PBEPBE/SDD
converged: YES YES NO NO
title: Mulliken charges:
elementType: Cl N C C C C C C C C H H H H H H H H H H H H H H H H H H
charge: -0.095850 -0.111407 -0.340901 -0.343577 -0.330213 -0.350726 -0.360416 -0.576446 -0.682529 -0.683189 0.188983 0.204146 0.189273 0.204501 0.228274 0.228579 0.211634 0.194850 0.214715 0.197807 0.272757 0.262138 0.208598 0.208918 0.221313 0.208818 0.207945 0.222003
chargesum: 0.00000
title: Mulliken charges with hydrogens summed into heavy atoms:
elementType: Cl N C C C C C C C C
charge: -0.095850 -0.111407 0.052229 0.050197 0.126640 0.055758 0.052106 -0.041550 -0.043699 -0.044422
polarizability: 1.28098256e+02 8.87076398e-01 1.07779597e+02 -1.64269611e+00 -1.55777840e-02 8.41302329e+01
1716.lowfreq: -9.9187 -0.0003 0.0017 0.0023 3.7268 7.6235 27.7777 46.5006 61.2657
frequency: 27.6370 46.3434 61.2339 65.9314 77.6109 96.3235 173.9130 196.4110 215.1439 222.3626 228.9894 253.7586 315.4108 340.9005 376.3131 467.3869 516.5079 642.6661 742.7035 747.2253 769.5330 815.4413 866.5795 875.9149 895.5324 914.3202 995.1404 1042.0514 1044.8445 1060.1864 1080.4037 1084.6373 1109.3525 1114.3655 1137.8290 1199.2834 1220.0611 1237.8903 1256.3722 1258.4813 1280.5620 1291.5212 1296.5140 1314.3203 1319.9171 1355.3721 1367.8457 1375.9272 1390.8740 1391.6284 1449.7063 1465.9252 1466.4776 1474.9977 1476.3541 1478.7254 1478.9421 1479.5602 1487.0084 1489.1917 2857.2847 2866.2376 2945.0786 2973.6544 2974.0372 2981.5941 2984.5663 3010.6256 3021.1319 3038.9801 3041.6628 3049.9584 3062.6871 3070.8082 3071.5013 3077.0039 3077.1712 3151.5373
redmass: 4.0954 3.2741 3.0422 1.7662 1.7191 2.3173 2.3284 3.4146 2.0818 1.1143 1.3122 3.7431 2.8474 2.6368 3.4772 3.3249 3.0209 6.0870 1.0957 1.0925 1.1346 3.1223 1.3051 1.2163 1.5692 2.0351 1.4867 2.9170 2.6009 3.2211 1.8772 2.1256 1.8889 2.1618 1.5550 2.0703 1.6965 1.1600 1.3582 1.3420 1.1292 1.1644 1.1973 1.4325 1.4403 1.3420 1.3953 1.4057 1.2163 1.2169 1.0940 1.0711 1.0728 1.0733 1.0667 1.0485 1.0449 1.0573 1.0781 1.0849 1.0705 1.0703 1.0676 1.0358 1.0358 1.0619 1.0619 1.0870 1.0882 1.1002 1.0988 1.0937 1.0579 1.1010 1.1012 1.0990 1.0989 1.1122
irintensity: 0.3628 0.4126 0.0319 0.0625 0.7502 1.2699 1.1759 5.2846 2.0155 0.1222 0.4500 0.0624 1.1697 0.7461 10.5239 0.8878 4.6242 119.0030 6.4520 5.9801 7.5597 15.8543 2.2830 2.7360 3.0049 2.9458 8.8938 11.6481 4.4222 2.3733 44.8264 41.5365 4.2910 5.6272 0.3465 15.2570 11.2776 19.9007 9.3752 0.7018 1.2422 7.8111 5.6926 4.7876 10.5620 1.0666 2.7049 2.7775 18.6343 13.7296 6.2792 1.9108 1.8776 1.9159 3.0546 6.3983 10.5443 21.8575 16.1496 10.6228 45.7467 145.1173 49.0457 51.7484 33.3405 24.5018 25.1956 16.8944 12.6807 6.2389 16.7315 17.7923 14.7077 80.5732 93.8954 26.9231 66.8989 17.9342
temp: 298.150 k
press: 1.00000 atm
elementType: 17 7 6 6 6 6 6 6 6 6 1 1 1 1 1 1 1 1 1 1 1 1 1 1 1 1 1 1
symmnumber: 1
zpe: 653040.7 jmol-1
zpe.correction: 0.248730 hartree
zpe.thermalcorrener: 0.262414 hartree
zpe.thermalcorrenthalpy: 0.263358 hartree
zpe.thermalcorrgfe: 0.206224 hartree
zpe.sumelectzpe: -829.591410 hartree
zpe.sumelectthermal: -829.577726 hartree
zpe.sumelectthermalent: -829.576782 hartree
zpe.sumelectthermalfe: -829.633916 hartree
dipole: 3.1291 0.3336 0.3091
dipole: 3.1620
quadrupole: -82.8688 -69.2729 -71.1881
quadrupole: -1.9418 0.4181 0.2023
quadrupole: -8.4256 5.1704 3.2552 -1.9418 0.4181 0.2023
hfenergy: -829.8401399 hartree
pointgroup: C01 [X(C8H18Cl1N1)]
dipole: -1.1918227 -0.2998438 0.1929247 debye
polarizability: 127.5083539|3.6383402|108.4090677|-0.9617462|0.0221901|84.0906646 unknown
InChI: InChI=1S/C8H18ClN/c1-3-6-10(7-4-2)8-5-9/h3-8H2,1-2H3
charge 0 multiplicity 1
28 atoms
Cl 3.930976 1.185044 -0.272592
N  -0.033574 0.059372 0.23667
C  -0.922255 1.188403 0.605561
C  -0.565578 -1.288635 0.548179
C  1.393768 0.260957 0.566283
C  -2.094341 1.392614 -0.379757
C  -0.072489 -2.377891 -0.429277
C  2.099621 0.838403 -0.668283
C  -3.014391 2.558266 0.043366
C  -0.621983 -3.775183 -0.069759
H  -1.328602 1.066737 1.641283
H  -0.312918 2.112997 0.618029
H  -0.316792 -1.595802 1.595622
H  -1.669317 -1.241262 0.490335
H  1.864853 -0.702217 0.833555
H  1.538932 0.941255 1.433334
H  -1.67497 1.575019 -1.387416
H  -2.688722 0.460538 -0.452644
H  -0.379104 -2.092246 -1.453446
H  1.035518 -2.406666 -0.428009
H  2.100817 0.12961 -1.508426
H  1.680624 1.807473 -0.978263
H  -3.457141 2.377611 1.041333
H  -2.455442 3.512072 0.092445
H  -3.844099 2.692123 -0.673866
H  -0.305184 -4.081337 0.945401
H  -1.728213 -3.78828 -0.094051
H  -0.261293 -4.540675 -0.780109
