program: Gaussian 09
title: 000235840
version: EM64L-G09RevD.01
frameworkgroup: C1[X(C19H17NO2)]
method: RPBEPBE
basis: SDD
operation: Freq
keyword: #p
keyword: freq=noraman
keyword: PBEPBE/SDD
title: #p freq=noraman PBEPBE/SDD
converged: YES YES NO NO
title: Mulliken charges:
elementType: O O N C C C C C C C C C C C C C C C C C C C H H H H H H H H H H H H H H H H H
charge: -0.431373 -0.247151 -0.240797 0.135453 0.385165 0.095154 0.445592 -0.325423 -0.577925 0.478977 0.188348 -0.611035 -0.420259 -0.420628 -0.682026 -0.331238 -0.367251 -0.247016 -0.240425 -0.225561 -0.230018 -0.249954 0.216074 0.239645 0.264378 0.229257 0.245453 0.237710 0.222766 0.243778 0.217264 0.278054 0.229965 0.230348 0.228530 0.225832 0.223956 0.227679 0.358702
chargesum: 0.00000
title: Mulliken charges with hydrogens summed into heavy atoms:
elementType: O O N C C C C C C C C C C C C C C C C C C C
charge: -0.072672 -0.247151 -0.240797 0.135453 0.385165 0.095154 0.445592 0.130296 -0.313547 0.478977 0.188348 -0.381778 -0.174806 -0.182918 0.001783 -0.053184 -0.137286 -0.016668 -0.011895 0.000271 -0.006063 -0.022274
polarizability: 3.70785491e+02 1.19227827e+01 2.07579955e+02 -1.78521179e+01 -9.23896571e+00 1.21108182e+02
1716.lowfreq: -7.5926 -4.7413 -0.0008 -0.0007 -0.0004 2.8852 19.1814 22.3532 36.3817
frequency: 18.7655 22.2971 36.3571 52.9920 71.5947 93.5288 124.2268 137.5271 163.4310 178.4657 204.8347 231.5141 264.8784 283.1520 297.0271 312.8545 353.1478 377.4201 394.5120 403.7282 416.0335 437.1682 453.9796 474.1365 501.8593 518.0497 535.3592 569.1493 581.4307 613.8994 620.2450 653.5679 685.6342 692.4168 710.1125 743.7968 754.9470 764.5083 768.7930 773.1510 789.5347 829.1102 834.2021 840.6746 879.9958 901.6364 904.8093 920.7045 951.4287 963.4613 964.4307 985.7708 988.8087 989.8776 1014.9521 1023.6079 1030.5802 1079.1776 1086.7512 1110.5104 1115.3178 1132.5631 1164.4204 1172.4269 1174.2031 1189.4271 1190.6561 1220.9000 1244.9098 1264.1939 1274.5836 1287.0678 1318.4848 1327.8822 1345.7933 1370.0123 1382.6644 1389.7676 1407.0639 1428.7043 1438.6382 1441.1353 1466.0229 1466.8980 1478.4255 1484.6004 1490.5023 1520.3722 1552.1549 1579.3865 1591.9193 1603.3073 1610.8387 1639.2980 2988.8201 3013.1054 3082.8701 3085.2059 3106.7077 3107.7773 3120.8207 3125.8533 3127.4432 3136.4496 3141.1941 3144.0350 3151.6468 3163.5365 3164.7008 3200.9799 3578.1931
redmass: 3.9285 6.2369 4.4907 4.0369 3.3865 4.0274 5.4929 4.4236 5.1521 3.6117 1.5198 3.1444 4.0545 4.1123 3.3894 4.0773 3.7273 1.1864 3.6253 2.9380 4.4856 4.9639 4.4051 2.5486 5.4300 4.1832 4.3677 4.7316 4.5634 6.2833 6.7162 4.5094 4.7064 2.0227 6.2078 5.0797 1.3506 2.4536 1.9963 2.1954 1.7899 1.5266 1.4538 2.1049 1.6026 5.0304 1.4389 1.7053 2.2556 1.3835 1.4180 1.6142 3.2321 1.3402 3.9070 2.2990 2.1901 2.2303 1.8073 2.1857 1.8979 1.5939 1.8071 1.0528 1.1031 1.3048 1.1601 2.8192 1.9377 1.5568 2.0144 2.3257 1.4145 1.8086 1.6203 2.0195 6.8306 1.2149 5.4896 5.5147 2.7261 2.5287 1.6662 1.3431 1.0978 2.1613 1.0819 3.9176 10.1503 7.3583 6.4858 6.1768 6.2223 7.0544 1.0358 1.0672 1.0964 1.0992 1.0992 1.0912 1.0861 1.0847 1.0887 1.0893 1.0920 1.0948 1.0939 1.1004 1.0999 1.0948 1.0660
irintensity: 0.3375 1.5721 0.3607 1.4435 1.2222 1.0849 0.8069 0.1883 0.4370 1.5618 0.4225 3.0180 3.4889 3.1455 0.9207 4.5374 9.8400 107.1252 1.7587 1.0339 2.0870 1.8030 5.0295 35.0622 17.1886 2.2938 8.2742 13.8990 3.5260 1.0384 4.2477 8.2790 6.7610 46.5924 15.2305 10.8674 27.1926 53.8654 16.0192 10.5171 33.9096 2.5865 27.4015 8.4689 31.9210 0.0609 2.5643 11.7302 9.1334 1.0926 8.9496 0.0176 0.4191 0.0130 11.4267 3.0419 23.2984 37.6501 0.4957 101.0597 114.3771 71.7753 13.8539 0.3719 5.8975 6.6287 1.0922 42.7648 126.3470 76.4909 2.3457 3.0958 17.8384 13.4085 199.8114 145.3652 7.6608 21.6816 8.4810 2.8009 50.0613 24.4429 11.3033 7.1859 14.1810 98.4703 7.3762 18.5112 184.4430 8.0827 12.8286 59.1692 34.9922 62.4634 24.8143 22.9967 0.8867 33.1438 41.0009 14.4215 5.4804 1.4575 0.1487 11.6114 0.2328 32.0022 38.1338 41.3113 23.7842 0.9473 41.8115
temp: 298.150 k
press: 1.00000 atm
elementType: 8 8 7 6 6 6 6 6 6 6 6 6 6 6 6 6 6 6 6 6 6 6 1 1 1 1 1 1 1 1 1 1 1 1 1 1 1 1 1
symmnumber: 1
zpe: 810974.8 jmol-1
zpe.correction: 0.308884 hartree
zpe.thermalcorrener: 0.327971 hartree
zpe.thermalcorrenthalpy: 0.328915 hartree
zpe.thermalcorrgfe: 0.259662 hartree
zpe.sumelectzpe: -937.892359 hartree
zpe.sumelectthermal: -937.873272 hartree
zpe.sumelectthermalent: -937.872328 hartree
zpe.sumelectthermalfe: -937.941581 hartree
dipole: -1.6986 3.6941 2.3708
dipole: 4.7066
quadrupole: -110.0017 -111.9409 -134.9801
quadrupole: -0.4520 2.6162 -8.7424
quadrupole: 8.9725 7.0333 -16.0058 -0.4520 2.6162 -8.7424
hfenergy: -938.2012432 hartree
pointgroup: C01 [X(C19H17N1O2)]
dipole: 0.7260539 0.1193374 -1.6992705 debye
polarizability: 371.3194261|-15.6133573|159.3036081|7.0827092|-44.5912904|168.8505937 unknown
InChI: InChI=1S/C19H17NO2/c1-2-20(16-10-4-3-5-11-16)19(22)17-12-14-8-6-7-9-15(14)13-18(17)21/h3-13,21H,2H2,1H3
charge 0 multiplicity 1
39 atoms
O  0.281564 2.097476 -1.047079
O  -0.939788 0.011133 1.897144
N  -1.592213 -0.238528 -0.348237
C  0.81106 0.138969 0.261876
C  3.166345 -0.537902 0.620924
C  -0.643546 -0.027829 0.662007
C  3.616022 0.57106 -0.196174
C  -1.191616 -0.476636 -1.764285
C  1.762153 -0.709021 0.837359
C  -3.009761 -0.220357 -0.052822
C  1.276649 1.245925 -0.5315
C  2.639649 1.455937 -0.754999
C  4.137839 -1.421242 1.196402
C  5.023054 0.74969 -0.40837
C  -1.724543 -1.816075 -2.310664
C  -3.535162 -0.849453 1.105784
C  -3.897533 0.42491 -0.953226
C  5.50248 -1.223727 0.97343
C  5.946228 -0.12966 0.163209
C  -4.924764 -0.823059 1.353205
C  -5.285726 0.441108 -0.700254
C  -5.808833 -0.182284 0.455458
H  -1.522553 0.367749 -2.395801
H  -0.092013 -0.482507 -1.800928
H  1.415398 -1.519414 1.488373
H  2.976718 2.309333 -1.358995
H  3.792477 -2.25537 1.818606
H  5.367369 1.588413 -1.025324
H  -1.351676 -2.662379 -1.70669
H  -2.827238 -1.850172 -2.307383
H  -1.37893 -1.954951 -3.351463
H  -2.858736 -1.335143 1.810231
H  -3.507008 0.930484 -1.842207
H  6.238746 -1.902116 1.417405
H  7.0190 0.016087 -0.00519
H  -5.315907 -1.309895 2.253615
H  -5.955636 0.948426 -1.403653
H  -6.886156 -0.16719 0.653433
H  0.688082 2.887108 -1.483116
