program: Gaussian 09
title: 000020660
version: EM64L-G09RevD.01
frameworkgroup: C1[X(C17H28)]
method: RPBEPBE
basis: SDD
operation: Freq
keyword: #p
keyword: freq=noraman
keyword: PBEPBE/SDD
title: #p freq=noraman PBEPBE/SDD
converged: YES YES NO NO
title: Mulliken charges:
elementType: C C C C C C C C C C C C C C C C C H H H H H H H H H H H H H H H H H H H H H H H H H H H H
charge: -0.185008 -0.441416 -0.441727 -0.372989 -0.374911 0.500045 -0.348994 -0.348525 -0.359992 -0.360404 -0.446440 -0.402746 -0.698247 -0.698130 -0.227914 -0.247618 -0.248544 0.194792 0.196874 0.194367 0.196867 0.194874 0.182230 0.216520 0.217103 0.182294 0.184825 0.188515 0.188678 0.184720 0.194264 0.198503 0.198435 0.194315 0.230989 0.227268 0.209911 0.214926 0.208963 0.214905 0.210041 0.208928 0.222561 0.221101 0.225791
chargesum: 0.00000
title: Mulliken charges with hydrogens summed into heavy atoms:
elementType: C C C C C C C C C C C C C C C C C
charge: 0.009784 -0.050175 -0.049986 0.025761 0.024485 0.500045 0.024346 0.024873 0.032775 0.032345 -0.215452 -0.175478 -0.064447 -0.064255 -0.005353 -0.026517 -0.022753
polarizability: 1.83987373e+02 -6.78608752e-03 1.93282000e+02 1.48916532e-01 -1.65992601e+00 1.60877289e+02
1716.lowfreq: -15.6940 -9.3657 -6.7003 -0.0004 0.0008 0.0010 18.3407 29.1210 31.2520
frequency: 14.8199 28.9250 31.1600 34.3027 37.4280 47.0354 79.4880 99.8669 108.9739 120.0093 122.3588 164.3230 177.1362 200.8811 216.0876 222.5359 225.9944 232.1977 320.1789 337.6665 380.8758 403.2629 439.9807 472.4717 506.1063 554.5590 574.0886 616.9697 704.1825 718.4899 720.5369 729.2091 739.7231 767.8610 774.8933 827.6895 849.0447 855.3039 886.0571 890.5626 914.2120 943.7929 964.0974 971.1570 978.1395 988.7298 992.1388 995.9240 1020.6622 1029.6467 1032.9183 1052.6135 1068.1503 1069.0064 1075.1619 1079.2106 1095.1916 1113.1767 1114.7005 1134.8226 1170.4953 1186.8198 1195.5288 1196.1639 1201.9287 1221.1043 1244.5887 1251.3641 1254.5579 1276.3406 1283.6474 1284.9577 1285.7939 1288.5498 1301.5507 1311.9640 1319.0738 1340.0413 1345.9131 1351.0124 1352.3792 1357.0561 1382.9866 1388.0885 1388.1376 1439.7856 1453.7474 1460.9233 1462.0060 1462.5959 1468.6357 1470.5799 1475.9113 1476.1807 1478.7312 1479.2962 1481.7588 1487.0594 1487.3241 1590.6550 1611.7103 2948.4832 2949.0193 2950.2859 2952.2167 2954.4116 2958.7012 2963.0843 2967.5224 2968.2751 2970.4876 2970.5852 2988.5601 2988.9631 2999.1587 3004.2174 3017.5081 3020.4085 3036.7171 3039.5082 3067.0147 3067.1974 3069.1581 3069.2695 3112.6776 3114.0500 3129.8862 3140.2109 3159.7314
redmass: 2.7218 2.1375 3.4394 3.1237 2.2651 2.1224 2.8627 2.5959 3.2272 1.7694 1.7874 2.5360 3.3155 4.1126 2.8829 1.1274 1.1155 3.1717 2.9092 3.2681 3.6231 2.8057 2.9960 3.1131 3.5073 2.7389 2.6642 6.3865 1.6650 1.3114 1.1021 1.5245 1.1373 1.4309 1.8394 1.2551 1.2501 1.2997 1.9169 1.8526 1.4483 1.2654 1.3082 1.4025 3.8363 4.9706 1.3232 4.2228 2.7818 2.0902 2.1719 1.8736 1.9780 1.9686 2.2361 2.1484 1.9476 1.7632 2.1973 2.5110 1.0586 1.1105 1.6923 1.8207 1.6875 1.2840 1.3132 1.3804 1.2694 1.1990 1.0918 1.0787 1.1739 1.1217 1.3114 1.3535 1.3386 1.5183 1.4360 1.5371 1.6410 1.6181 5.3600 1.2170 1.2180 2.1301 1.0772 1.0778 1.0725 1.0770 1.0755 1.0831 1.0425 1.0428 1.0768 1.1451 1.9989 1.0856 1.0882 5.9623 6.1655 1.0663 1.0600 1.0709 1.0594 1.0615 1.0608 1.0616 1.0586 1.0594 1.0373 1.0373 1.0958 1.0958 1.0997 1.0990 1.1033 1.1032 1.1042 1.1036 1.1007 1.1007 1.0992 1.0992 1.0850 1.0875 1.0908 1.0958 1.1014
irintensity: 0.0023 0.0052 0.0151 0.0028 0.0080 0.0122 0.0310 0.0271 0.0772 0.0011 0.0079 0.7162 0.0470 0.0292 0.1503 0.0065 0.0008 0.3675 0.0108 0.1491 0.0794 0.0241 0.1794 4.9313 1.1029 0.1901 16.8184 0.0517 52.9265 20.0087 6.2959 3.2706 5.3604 0.5640 32.2858 0.5120 0.0104 6.9277 2.6921 6.8954 3.7962 0.9065 0.6017 0.0380 0.1014 0.1212 0.1710 0.3090 4.6402 0.3291 2.2364 0.0032 7.3390 2.4821 1.1964 0.3158 14.7547 5.1752 9.7438 0.5750 0.0383 0.0979 0.1590 0.2666 0.4852 7.8233 0.5189 0.6513 0.4328 0.2771 0.8992 0.5578 0.6074 0.0646 0.3312 2.9843 0.1772 1.0771 0.5401 2.3017 0.5259 4.2861 0.5855 12.1409 11.2641 8.5781 0.4104 2.0581 0.1397 0.4047 1.2253 0.7007 11.8877 12.0462 2.8386 1.3537 15.6676 5.1658 33.6006 1.3478 7.9979 5.6002 0.3159 15.2974 0.1072 2.1346 1.0517 22.9694 2.9593 253.1143 55.6156 14.3339 1.4963 7.7684 0.0053 11.9112 0.0440 0.2406 2.3170 205.8218 49.4356 137.4791 50.9216 56.0660 11.1703 3.2113 11.6049 46.7405 25.7981
temp: 298.150 k
press: 1.00000 atm
elementType: 6 6 6 6 6 6 6 6 6 6 6 6 6 6 6 6 6 1 1 1 1 1 1 1 1 1 1 1 1 1 1 1 1 1 1 1 1 1 1 1 1 1 1 1 1
symmnumber: 1
zpe: 1061153.1 jmol-1
zpe.correction: 0.404172 hartree
zpe.thermalcorrener: 0.424449 hartree
zpe.thermalcorrenthalpy: 0.425394 hartree
zpe.thermalcorrgfe: 0.351105 hartree
zpe.sumelectzpe: -663.268520 hartree
zpe.sumelectthermal: -663.248242 hartree
zpe.sumelectthermalent: -663.247298 hartree
zpe.sumelectthermalfe: -663.321586 hartree
dipole: -0.0017 -0.2635 -0.0714
dipole: 0.2730
quadrupole: -113.2824 -104.0700 -102.9634
quadrupole: -0.0256 0.0074 1.0605
quadrupole: -6.5104 2.7019 3.8085 -0.0256 0.0074 1.0605
hfenergy: -663.6726914 hartree
pointgroup: C01 [X(C17H28)]
dipole: 0.0010992 0.1036727 -0.0279886 debye
polarizability: 183.975205|-0.0972499|193.279636|0.5570947|1.6779134|160.8918215 unknown
InChI: InChI=1S/C17H28/c1-3-5-8-12-16(13-9-6-4-2)17-14-10-7-11-15-17/h7,10-11,14-16H,3-6,8-9,12-13H2,1-2H3
charge 0 multiplicity 1
45 atoms
C  0.004995 0.652805 -0.268474
C  1.264068 1.309584 0.37106
C  -1.296901 1.296743 0.294308
C  2.600302 0.859123 -0.25922
C  -2.58306 0.864774 -0.44397
C  0.006251 -0.869155 -0.098456
C  3.828974 1.560889 0.361889
C  -3.860931 1.50858 0.13951
C  5.168441 1.109987 -0.264452
C  -5.147297 1.101075 -0.614681
C  0.049172 -1.732054 -1.222517
C  -0.035017 -1.457937 1.194061
C  6.393845 1.814883 0.356578
C  -6.423119 1.736057 -0.020301
C  0.050797 -3.13796 -1.067472
C  -0.033402 -2.860483 1.356484
C  0.009465 -3.708949 0.224655
H  0.037285 0.870422 -1.357996
H  1.27999 1.092101 1.459384
H  1.170064 2.411545 0.275645
H  -1.392446 1.0503 1.372345
H  -1.197243 2.400722 0.235689
H  2.576476 1.062668 -1.350956
H  2.710081 -0.238206 -0.14953
H  -2.679097 -0.238746 -0.406465
H  -2.495182 1.134471 -1.517971
H  3.724509 2.66086 0.249035
H  3.851979 1.361902 1.454093
H  -3.959413 1.223483 1.2082
H  -3.761311 2.614613 0.121194
H  5.142787 1.303808 -1.356453
H  5.27196 0.011945 -0.147026
H  -5.241275 -0.003984 -0.600688
H  -5.050757 1.390529 -1.681272
H  0.081958 -1.297748 -2.229659
H  -0.068747 -0.814649 2.082195
H  6.456656 1.615489 1.443187
H  7.337789 1.470717 -0.105111
H  6.331383 2.91141 0.220996
H  -7.327077 1.431303 -0.579437
H  -6.560897 1.433768 1.035213
H  -6.365374 2.840841 -0.046882
H  0.084191 -3.784604 -1.952072
H  -0.065652 -3.293084 2.36337
H  0.010281 -4.797741 0.349271
