program: Gaussian 09
title: 000235831
version: EM64L-G09RevD.01
frameworkgroup: C1[X(C15H18N2O3S)]
method: RPBEPBE
basis: SDD
operation: Freq
keyword: #p
keyword: freq=noraman
keyword: PBEPBE/SDD
title: #p freq=noraman PBEPBE/SDD
converged: YES YES NO NO
title: Mulliken charges:
elementType: S O O O N N C C C C C C C C C C C C C C C H H H H H H H H H H H H H H H H H H
charge: 0.991327 -0.569221 -0.506737 -0.505727 -0.194806 -0.708952 -0.563785 -0.399562 0.436584 0.462599 -0.347114 -0.364415 -0.668812 -0.339330 -0.371330 -0.058315 -0.249626 -0.235618 -0.460200 -0.444927 0.521815 0.240097 0.254688 0.225827 0.226429 0.286190 0.244769 0.211538 0.237826 0.216246 0.233318 0.225397 0.282545 0.283056 0.214555 0.212277 0.300502 0.299598 0.381293
chargesum: 0.00000
title: Mulliken charges with hydrogens summed into heavy atoms:
elementType: S O O O N N C C C C C C C C C C C C C C C
charge: 0.991327 -0.187928 -0.506737 -0.505727 -0.194806 -0.108852 -0.069000 0.052695 0.436584 0.462599 -0.060924 -0.119646 -0.003202 -0.106012 -0.145933 -0.058315 0.032919 0.047438 -0.245644 -0.232650 0.521815
polarizability: 3.00231288e+02 1.75442255e+01 2.15351624e+02 -1.64004038e+01 -3.89351171e+00 1.58822763e+02
1716.lowfreq: -5.3135 -1.9601 -0.0017 -0.0013 0.0004 6.7670 14.5836 20.5653 34.7370
frequency: 13.1537 20.5541 34.7367 42.6222 52.1223 72.3893 99.3620 109.5625 127.0764 155.9804 168.1738 176.5091 198.3436 223.0632 240.0646 265.0245 268.1047 284.8415 301.0342 310.4416 313.7980 344.2114 362.5963 368.9699 386.3831 400.2698 406.3893 416.3954 433.1414 486.5983 495.3249 516.9200 540.0753 562.8236 614.9970 627.3616 640.6788 699.2296 706.6591 712.1294 775.1274 791.7153 794.2722 805.7545 816.3412 823.4995 834.2550 853.2184 885.9882 908.4017 924.5265 961.3035 965.7109 985.9062 990.0695 990.7733 994.8252 1016.7096 1021.5061 1044.5311 1056.3624 1073.9053 1113.3058 1127.2019 1140.8335 1174.6614 1183.1704 1200.9155 1204.0629 1245.9246 1281.2895 1287.1818 1308.8435 1323.1796 1330.9175 1351.5446 1375.6724 1387.0255 1389.6545 1394.5591 1406.5219 1442.6960 1455.9672 1468.0507 1468.8447 1481.2949 1493.5402 1525.9833 1574.3006 1589.3244 1596.3575 1633.7819 1655.3754 2955.3003 2981.0220 2985.8427 3003.4353 3037.2533 3074.7128 3090.5737 3115.2099 3117.8632 3127.6385 3147.4034 3153.5722 3157.1056 3164.7519 3170.8097 3479.7487 3574.5006 3715.1070
redmass: 5.5611 6.9752 4.3153 4.1066 3.6193 5.4310 5.7844 3.6114 4.4961 6.2941 1.8318 2.8442 1.3039 3.9744 2.5877 1.2297 4.3284 3.8572 5.8067 1.0515 4.0351 6.5054 3.8562 4.1176 3.1557 4.0535 2.9355 2.8376 6.4386 2.8892 3.4109 2.2180 4.9102 6.3407 6.9546 5.5853 6.5639 3.6991 3.6098 3.4778 4.0259 1.2791 1.2496 1.7911 2.0120 2.4948 11.4972 1.2555 2.2449 1.3927 1.3423 1.5196 12.2096 1.9527 2.6092 2.9181 2.1797 1.5189 2.0212 1.3698 1.8424 1.9368 1.3328 1.9203 1.3284 1.6468 1.5660 1.3185 1.6712 1.6180 1.2807 1.3120 2.6020 1.4681 1.4185 1.2959 5.5730 1.2478 3.6033 3.0730 2.4049 2.4280 1.3796 1.1588 1.6489 1.0637 1.1120 2.9304 6.7797 6.1818 6.8640 1.2165 4.9753 1.0592 1.0364 1.0617 1.1003 1.1015 1.0996 1.1005 1.0887 1.0877 1.0897 1.0940 1.0883 1.0938 1.0953 1.0969 1.0661 1.0446 1.1041
irintensity: 0.2092 0.7820 1.3405 1.7611 0.3273 0.2213 2.6812 0.4553 0.2077 0.6913 44.4553 8.5358 1.8322 11.6670 1.3800 309.8153 48.5030 49.0248 11.8274 0.0552 7.7089 1.6096 4.0080 7.2652 0.5310 40.4163 1.7775 0.0295 36.1887 7.1117 6.6128 22.6802 39.0817 140.5308 4.6607 24.1838 0.0905 22.2129 4.3762 0.5785 6.3078 0.8491 16.7752 98.5815 10.1886 28.4531 68.8512 1.3960 20.0916 1.3325 0.1773 16.8232 94.9865 26.0350 7.3950 0.6872 3.7999 2.6034 9.9474 35.7228 90.2776 14.9969 2.9698 19.7370 9.4409 17.8155 5.6374 15.5018 43.5006 99.0378 24.4791 13.5889 72.5328 15.8602 6.9138 31.8375 19.9882 32.3796 25.7360 39.1940 8.5151 18.5432 31.2030 2.7860 12.8056 3.3150 12.2759 500.8551 0.5399 12.9911 4.7151 130.2074 40.8013 38.4752 30.5107 37.5862 13.9528 9.7948 47.2928 44.4568 12.2126 48.3503 9.5213 26.8078 2.7777 11.4106 1.9875 1.3172 40.1991 75.7205 18.2077
temp: 298.150 k
press: 1.00000 atm
elementType: 16 8 8 8 7 7 6 6 6 6 6 6 6 6 6 6 6 6 6 6 6 1 1 1 1 1 1 1 1 1 1 1 1 1 1 1 1 1 1
symmnumber: 1
zpe: 796573.3 jmol-1
zpe.correction: 0.303399 hartree
zpe.thermalcorrener: 0.325391 hartree
zpe.thermalcorrenthalpy: 0.326335 hartree
zpe.thermalcorrgfe: 0.249960 hartree
zpe.sumelectzpe: -1313.897309 hartree
zpe.sumelectthermal: -1313.875317 hartree
zpe.sumelectthermalent: -1313.874373 hartree
zpe.sumelectthermalfe: -1313.950748 hartree
dipole: -5.9164 0.2919 -1.6559
dipole: 6.1507
quadrupole: -143.3010 -114.4186 -133.8257
quadrupole: 2.2790 -13.6290 1.3781
quadrupole: -12.7859 16.0965 -3.3106 2.2790 -13.6290 1.3781
hfenergy: -1314.2007082 hartree
pointgroup: C01 [X(C15H18N2O3S1)]
dipole: 2.32829 -0.2993485 0.587509 debye
polarizability: 291.2042477|-29.8189029|223.0041229|-19.6320715|9.5022095|160.1973045 unknown
InChI: InChI=1S/C15H18N2O3S/c1-2-17(14-7-5-13(16)6-8-14)11-12-3-9-15(10-4-12)21(18,19)20/h3-10,18H,2,11,16H2,1H3
charge 0 multiplicity 1
39 atoms
S  -4.99942 0.336256 -0.271157
O  -5.147551 -1.239003 0.709518
O  -5.931192 1.46046 0.427719
O  -5.184704 -0.022968 -1.838471
N  1.907603 1.115325 -0.038275
N  4.605127 -3.922006 -0.177118
C  0.954201 1.422827 1.025052
C  2.286783 2.222957 -0.933676
C  -0.5193 1.145801 0.691434
C  2.58879 -0.131109 -0.06866
C  -0.875812 0.368332 -0.437567
C  -1.539299 1.675012 1.524854
C  3.427564 3.120885 -0.391975
C  2.103251 -1.256371 0.662692
C  3.769479 -0.32528 -0.844085
C  -3.200012 0.645154 0.124659
C  -2.230918 0.104011 -0.734034
C  -2.900631 1.427558 1.251957
C  2.768701 -2.497163 0.632824
C  4.425203 -1.571362 -0.886347
C  3.944965 -2.684819 -0.143641
H  1.05043 2.4934 1.29749
H  1.223723 0.860278 1.942113
H  2.56726 1.807346 -1.919338
H  1.38661 2.843533 -1.109423
H  -0.082755 -0.024287 -1.081356
H  -1.270771 2.287369 2.394306
H  3.142132 3.585492 0.569957
H  4.349611 2.537955 -0.223421
H  3.653758 3.933873 -1.107036
H  1.177523 -1.182505 1.243269
H  4.198576 0.502147 -1.417145
H  -2.524373 -0.48906 -1.605753
H  -3.700712 1.839853 1.874537
H  2.3582 -3.335962 1.208928
H  5.33156 -1.676505 -1.496157
H  4.255108 -4.712432 0.354515
H  5.436199 -4.053135 -0.744593
H  -6.082406 -1.577954 0.589504
