program: Gaussian 09
title: 000235809
version: EM64L-G09RevD.01
frameworkgroup: C1[X(C18H30N2O2)]
method: RPBEPBE
basis: SDD
operation: Freq
keyword: #p
keyword: freq=noraman
keyword: PBEPBE/SDD
title: #p freq=noraman PBEPBE/SDD
converged: YES YES NO NO
title: Mulliken charges:
elementType: O O N N C C C C C C C C C C C C C C C C C C H H H H H H H H H H H H H H H H H H H H H H H H H H H H H H
charge: -0.287975 -0.288002 -0.143325 -0.143405 -0.123487 -0.123556 -0.439844 -0.447320 -0.439817 -0.447245 -0.391408 -0.399656 -0.391440 -0.399667 -0.427823 -0.371965 -0.371941 -0.427810 0.188072 0.188199 -0.386620 -0.386610 0.220673 0.220600 0.225458 0.195706 0.202089 0.233629 0.225490 0.195696 0.202073 0.233612 0.203138 0.188806 0.188191 0.202682 0.203151 0.188818 0.188189 0.202672 0.226179 0.283647 0.235889 0.229916 0.235917 0.229888 0.226205 0.283623 0.199933 0.195420 0.199932 0.195421
chargesum: 0.00000
title: Mulliken charges with hydrogens summed into heavy atoms:
elementType: O O N N C C C C C C C C C C C C C C C C C C
charge: -0.287975 -0.288002 -0.143325 -0.143405 0.097186 0.097044 -0.018681 -0.011602 -0.018631 -0.011560 0.000536 -0.008783 0.000529 -0.008806 0.082004 0.093841 0.093864 0.082018 0.188072 0.188199 0.008733 0.008744
polarizability: 2.71714835e+02 1.81894335e+00 1.87612480e+02 -1.45177048e-03 1.27703001e-02 1.69269694e+02
1716.lowfreq: -12.6710 -5.5688 -0.0006 0.0002 0.0007 12.0330 15.4245 29.0588 40.6511
frequency: 15.4150 29.0382 40.6500 48.6978 55.3043 83.2896 95.3887 97.9165 146.5650 163.7549 184.4957 204.3485 216.2223 231.0030 231.9344 233.6555 282.0164 292.6805 295.5966 335.6840 337.8230 339.3740 365.5572 398.8846 431.3524 431.7868 460.0928 487.0539 491.4052 505.6505 521.9836 533.0650 630.5136 638.0383 693.2705 693.9903 766.7797 769.0515 788.8128 789.5684 795.1801 799.7398 849.6998 853.1796 861.0189 878.7731 880.8215 894.7242 894.8285 920.8525 923.1435 936.5724 937.0142 979.0822 992.0079 1008.6400 1038.3493 1049.7710 1050.0565 1051.6173 1055.4263 1055.5542 1071.3748 1071.8507 1078.7785 1084.6910 1114.4876 1114.5120 1136.7714 1137.6581 1162.4789 1177.3615 1180.3441 1197.8315 1202.4718 1210.0934 1234.0667 1237.5382 1248.7102 1253.1965 1255.6249 1263.0991 1264.7320 1273.9505 1289.2859 1291.6426 1304.7300 1305.1917 1320.0341 1320.0771 1334.4199 1336.6178 1336.6707 1337.8766 1339.3138 1343.0505 1343.2563 1345.8937 1355.5417 1355.6204 1357.8862 1358.4949 1388.2712 1390.0790 1462.9243 1463.0653 1464.0405 1464.1487 1466.5215 1466.6360 1472.3038 1473.0239 1475.8560 1477.2558 1478.2237 1480.4659 1481.9868 1496.6797 1576.1722 1577.6875 2961.0532 2961.1084 2963.5317 2963.8418 2964.1324 2968.9881 2969.5288 2969.5758 2972.7672 2972.8563 2974.7999 2981.3253 2983.0349 2984.9409 2992.5251 2992.5506 3023.7193 3023.7545 3028.0854 3028.3452 3028.8642 3031.7551 3032.1698 3032.4041 3040.8885 3040.9314 3058.8597 3058.9127 3075.7985 3077.7249
redmass: 3.6665 3.4959 3.5770 5.9802 4.4630 3.4352 3.3815 3.5938 3.7101 3.2578 2.8997 3.2881 2.8724 3.6092 1.9638 2.0582 4.9335 2.4881 3.1358 2.5506 2.3135 2.4352 2.1750 2.6248 2.9929 3.0284 3.1329 2.0798 1.9488 3.1293 2.5475 2.7237 4.8054 1.8994 7.6313 7.7481 2.9115 2.4620 1.5641 1.4688 2.7986 3.5085 2.1437 2.0786 1.4925 1.7928 1.7698 1.5811 1.5855 1.8993 1.8540 2.9431 2.3829 2.1904 2.4097 2.4172 2.4589 1.7897 1.6967 1.8264 1.3350 1.3501 1.5003 1.3746 1.8156 1.9701 2.3650 2.3702 2.3176 2.2347 2.3929 1.4515 1.6186 1.4409 1.3450 2.0152 1.3425 1.6620 1.5056 1.2966 1.3729 1.2888 1.2663 1.5392 1.3007 1.2729 1.2695 1.2640 1.3886 1.3738 1.3089 1.3739 1.3697 1.6448 1.6072 1.4842 1.4857 1.6004 1.4706 1.4623 1.3703 1.4069 3.0347 2.2633 1.0861 1.0863 1.0850 1.0852 1.0877 1.0875 1.0880 1.0840 1.0921 1.0827 1.0920 1.0925 1.0923 1.0814 7.5768 7.8970 1.0639 1.0638 1.0632 1.0612 1.0634 1.0627 1.0626 1.0625 1.0620 1.0619 1.0667 1.0777 1.0796 1.0708 1.0625 1.0625 1.0980 1.0980 1.0952 1.0938 1.1004 1.1021 1.1024 1.1021 1.1034 1.1034 1.1014 1.1014 1.0938 1.0957
irintensity: 1.3155 0.0526 1.0845 4.8539 0.8108 1.7764 3.3691 0.9682 2.3890 3.6739 0.9032 0.6301 5.8401 0.0005 0.8799 0.4199 1.9620 11.1612 0.0680 0.1612 1.4013 7.9644 9.8960 0.3973 0.3268 0.0539 1.0644 0.0105 18.3952 1.2172 0.0749 15.4960 2.0683 3.1034 1.8101 7.4897 0.0131 3.6020 0.0099 0.0615 0.0507 1.0900 0.5499 19.3894 0.6877 4.8999 0.0020 15.7839 9.3750 4.7606 0.4038 0.6262 1.5770 3.7302 102.1346 0.0163 2.4339 0.0161 6.6387 0.0220 0.0068 0.1927 0.1707 2.4838 0.0614 39.1027 0.0783 0.0638 15.6583 0.0147 52.1545 0.0306 8.9958 7.1472 117.8546 0.1881 6.6632 0.6584 8.7092 0.4535 11.4712 15.2243 0.3022 105.5457 44.6466 0.7815 2.9293 0.5690 8.5528 1.2357 0.4068 0.2287 0.3574 60.7518 0.3524 4.2428 1.9002 77.6616 0.0547 2.7103 25.9767 0.8521 14.7986 312.5255 15.2241 0.7996 3.4119 0.0756 11.0274 17.5859 14.1631 15.7144 20.7336 25.6631 0.1272 15.5411 0.0199 12.8434 444.3698 1.0856 24.6203 46.7782 3.4738 0.4973 111.9729 3.2825 65.8260 7.6515 28.7069 36.4260 5.2891 0.7021 28.6121 73.9420 28.5212 18.2195 60.4562 84.7822 162.8334 8.8070 9.6781 32.8368 22.3835 17.5532 26.3343 103.6249 94.2444 34.1403 15.4011 4.1792
temp: 298.150 k
press: 1.00000 atm
elementType: 8 8 7 7 6 6 6 6 6 6 6 6 6 6 6 6 6 6 6 6 6 6 1 1 1 1 1 1 1 1 1 1 1 1 1 1 1 1 1 1 1 1 1 1 1 1 1 1 1 1 1 1
symmnumber: 1
zpe: 1206584.1 jmol-1
zpe.correction: 0.459564 hartree
zpe.thermalcorrener: 0.481028 hartree
zpe.thermalcorrenthalpy: 0.481973 hartree
zpe.thermalcorrgfe: 0.407580 hartree
zpe.sumelectzpe: -962.159729 hartree
zpe.sumelectthermal: -962.138265 hartree
zpe.sumelectthermalent: -962.137321 hartree
zpe.sumelectthermalfe: -962.211713 hartree
dipole: 0.0004 -0.0002 -0.0830
dipole: 0.0830
quadrupole: -132.4616 -150.2258 -131.5311
quadrupole: -21.8620 -0.0136 -0.0093
quadrupole: 5.6112 -12.1530 6.5417 -21.8620 -0.0136 -0.0093
hfenergy: -962.619293 hartree
pointgroup: C01 [X(C18H30N2O2)]
dipole: 0.0001483 0.0000763 0.03267 debye
polarizability: 271.7516422|-0.4600416|187.5756808|0.0055039|0.0044347|169.2696859 unknown
InChI: InChI=1S/C18H30N2O2/c21-17(15-7-3-1-4-8-15)19-11-13-20(14-12-19)18(22)16-9-5-2-6-10-16/h15-16H,1-14H2
charge 0 multiplicity 1
52 atoms
O  2.800277 -2.26141 0.300565
O  -2.800887 2.26152 0.300665
N  1.37562 -0.438066 0.527165
N  -1.375672 0.438474 0.52561
C  3.716658 -0.063969 -0.289321
C  -3.716588 0.064332 -0.291079
C  4.554233 0.377559 0.952602
C  4.629674 -0.753205 -1.335183
C  -4.552387 -0.37836 0.951631
C  -4.63122 0.753843 -1.335352
C  5.730768 1.293342 0.544741
C  5.810035 0.160699 -1.739528
C  -5.729079 -1.294356 0.544714
C  -5.81172 -0.160304 -1.738746
C  0.30232 -1.314316 1.046146
C  1.045102 1.004747 0.373507
C  -1.044986 -1.004289 0.371853
C  -0.303017 1.314507 1.046279
C  2.601706 -1.00856 0.180074
C  -2.601415 1.009075 0.177485
C  6.633493 0.608968 -0.508664
C  -6.633419 -0.609679 -0.507108
H  3.28378 0.845528 -0.752125
H  -3.283922 -0.844698 -0.754986
H  4.944718 -0.535048 1.44551
H  3.908543 0.891297 1.692858
H  4.034293 -1.028943 -2.227016
H  5.002981 -1.699917 -0.902129
H  -4.942606 0.533759 1.445653
H  -3.905517 -0.892321 1.690704
H  -4.037089 1.030376 -2.227772
H  -5.004358 1.700137 -0.901245
H  6.322041 1.562884 1.441452
H  5.333326 2.241495 0.125655
H  5.421735 1.059406 -2.263802
H  6.460852 -0.370703 -2.460551
H  -6.3191 -1.564701 1.442009
H  -5.331795 -2.242087 0.124526
H  -5.423722 -1.058523 -2.26408
H  -6.463679 0.371278 -2.458604
H  0.212886 -1.204452 2.145458
H  0.608544 -2.353699 0.840848
H  0.986166 1.275445 -0.699737
H  1.824598 1.635585 0.840867
H  -0.984748 -1.274589 -0.701419
H  -1.825058 -1.635292 0.838034
H  -0.214926 1.204193 2.145657
H  -0.608989 2.353971 0.841007
H  7.446204 1.293821 -0.819222
H  7.116329 -0.279049 -0.051188
H  -7.446251 -1.294662 -0.817061
H  -7.116029 0.277856 -0.048458
