program: Gaussian 09
title: 000235795
version: EM64L-G09RevD.01
frameworkgroup: C1[X(C7H10N2O8)]
method: RPBEPBE
basis: SDD
operation: Freq
keyword: #p
keyword: freq=noraman
keyword: PBEPBE/SDD
title: #p freq=noraman PBEPBE/SDD
converged: NO YES NO NO
title: Mulliken charges:
elementType: O O O O O O O O N N C C C C C C C H H H H H H H H H H
charge: -0.160348 -0.173368 -0.172057 -0.158586 -0.396666 -0.407305 -0.246942 -0.234311 0.089788 0.091785 0.314818 -0.482778 -0.482896 -0.502210 -0.501038 0.213051 0.199649 0.273182 0.278721 0.278659 0.283955 0.274544 0.276056 0.274460 0.296813 0.389742 0.383280
chargesum: 0.00000
title: Mulliken charges with hydrogens summed into heavy atoms:
elementType: O O O O O O O O N N C C C C C C C
charge: -0.160348 -0.173368 -0.172057 -0.158586 -0.006924 -0.024025 -0.246942 -0.234311 0.089788 0.091785 0.314818 0.069125 0.079719 0.048389 0.070235 0.213051 0.199649
polarizability: 1.25907866e+02 -2.27222850e+00 1.11080078e+02 5.40533391e+00 9.15227812e+00 1.10730462e+02
1716.lowfreq: -11.1412 -0.0007 0.0004 0.0007 5.1038 9.5222 17.4876 37.1414 42.1987
frequency: 17.3548 37.0885 42.1912 44.8941 53.8066 56.2674 81.8776 105.4245 140.5829 159.5458 163.5326 174.7631 236.6304 266.6377 273.4699 310.9789 331.8891 397.7318 434.8401 452.1825 484.6678 492.4217 514.9076 525.7487 577.3284 593.8657 619.7405 648.6297 651.4126 699.5846 707.8567 756.3613 763.2600 783.1191 805.3249 877.4127 899.9214 938.2266 1004.0389 1037.7885 1043.6784 1072.2995 1088.1372 1089.9986 1163.2858 1180.0490 1196.9594 1220.2657 1227.5311 1257.9677 1266.8445 1275.5097 1289.9371 1326.8910 1350.9990 1380.9976 1384.1417 1417.5233 1419.1842 1439.0729 1445.1315 1459.2079 1464.9257 1658.0057 1663.1268 3003.2199 3009.0897 3034.1947 3036.2178 3066.8123 3070.2140 3096.2778 3098.2505 3514.8142 3515.0702
redmass: 9.2514 5.8983 8.3855 13.7220 13.5231 10.6255 8.3020 6.0753 4.0811 6.6636 4.6517 5.2808 4.7330 5.8529 3.6451 4.6224 2.6798 11.2951 5.1803 3.5835 3.5248 2.4903 2.7499 2.8025 4.2007 4.1162 4.0830 1.4572 1.4105 4.6373 6.6078 3.3183 5.7735 2.6935 3.3367 4.2858 2.5620 2.4909 2.2239 2.8692 3.1893 2.4128 2.4225 2.5014 1.7378 13.4820 1.1590 2.1219 3.0516 1.4025 1.5820 1.3393 1.7612 1.3737 1.4089 1.8963 1.7973 5.4664 4.9716 1.2009 1.1151 1.2040 1.1117 8.1283 8.3147 1.0624 1.0636 1.0604 1.0622 1.0963 1.0982 1.1014 1.1021 1.0641 1.0641
irintensity: 2.2628 0.7647 0.9599 0.2312 0.0665 0.2509 0.8806 3.5245 4.7029 0.0266 0.3233 3.8502 4.1189 1.5270 2.7312 1.0905 3.0893 4.3855 4.4519 24.6551 24.7368 29.7469 76.1670 3.5130 4.8548 32.8427 0.5539 161.0437 83.4453 14.7997 4.1585 26.0671 46.1313 21.7308 5.9343 1.9893 15.3711 4.9612 6.2675 150.8683 146.2635 27.9802 123.1571 142.7861 2.6446 98.0168 2.0057 20.1256 34.8618 2.3281 5.1941 29.0062 19.5575 46.2595 12.8082 57.7090 21.3903 165.6271 89.8539 41.9268 47.5425 30.8403 18.7468 138.7830 252.6294 10.0463 6.0963 4.7306 1.7564 1.8997 0.9792 4.6365 0.1517 21.2874 51.5404
temp: 298.150 k
press: 1.00000 atm
elementType: 8 8 8 8 8 8 8 8 7 7 6 6 6 6 6 6 6 1 1 1 1 1 1 1 1 1 1
symmnumber: 1
zpe: 492796.5 jmol-1
zpe.correction: 0.187696 hartree
zpe.thermalcorrener: 0.205462 hartree
zpe.thermalcorrenthalpy: 0.206406 hartree
zpe.thermalcorrgfe: 0.138692 hartree
zpe.sumelectzpe: -982.567756 hartree
zpe.sumelectthermal: -982.549991 hartree
zpe.sumelectthermalent: -982.549047 hartree
zpe.sumelectthermalfe: -982.616761 hartree
dipole: 3.5269 2.6120 -1.3780
dipole: 4.6001
quadrupole: -101.3135 -92.7555 -109.6861
quadrupole: -5.5275 2.7466 -6.2630
quadrupole: -0.0618 8.4962 -8.4344 -5.5275 2.7466 -6.2630
hfenergy: -982.7554523 hartree
pointgroup: C01 [X(C7H10N2O8)]
dipole: 0.7060148 -1.6413128 -0.2881303 debye
polarizability: 109.3863711|8.3546675|122.8857474|6.4222016|-6.0365009|115.4462881 unknown
InChI: InChI=1S/C7H10N2O8/c10-5(11)1-3-7(8(14)15,9(16)17)4-2-6(12)13/h10,12H,1-4H2
charge 0 multiplicity 1
27 atoms
O  -0.299479 1.993322 -2.18133
O  1.086214 2.965656 0.917081
O  -1.713301 2.552271 -0.479859
O  0.128216 1.527456 2.406594
O  2.434522 -2.607684 1.236763
O  -3.203222 -2.633493 -1.063089
O  1.211601 -2.427793 -0.727067
O  -2.14274 -2.655554 1.002614
N  -0.705999 1.929341 -0.97055
N  0.435584 1.903758 1.224739
C  0.049668 0.956535 0.017775
C  1.368839 0.49066 -0.624182
C  -0.952042 -0.102811 0.492299
C  2.226677 -0.409613 0.292343
C  -1.57058 -0.916791 -0.66392
C  1.878004 -1.886489 0.184037
C  -2.305392 -2.128275 -0.119671
H  1.133673 -0.049001 -1.557006
H  1.93749 1.392486 -0.906386
H  -0.449234 -0.784312 1.199388
H  -1.748093 0.401988 1.066175
H  2.197758 -0.112508 1.355949
H  3.287857 -0.31655 -0.009375
H  -2.27078 -0.319725 -1.273509
H  -0.789807 -1.310611 -1.342578
H  2.211567 -3.573913 1.143086
H  -3.6415 -3.450951 -0.700322
