program: Gaussian 09
title: 000000753
version: EM64L-G09RevD.01
frameworkgroup: C1[X(C3H8O3)]
method: RPBEPBE
basis: SDD
operation: Freq
keyword: #p
keyword: freq=noraman
keyword: PBEPBE/SDD
title: #p freq=noraman PBEPBE/SDD
converged: YES YES NO NO
title: Mulliken charges:
elementType: O O O C C C H H H H H H H H
charge: -0.494841 -0.447445 -0.477025 -0.062069 -0.298327 -0.339581 0.231577 0.187394 0.202519 0.199287 0.206526 0.372458 0.361353 0.358171
chargesum: 0.00000
title: Mulliken charges with hydrogens summed into heavy atoms:
elementType: O O O C C C
charge: -0.122383 -0.086092 -0.118853 0.169508 0.091587 0.066233
polarizability: 5.24119433e+01 1.24003369e-01 4.40876276e+01 1.03780454e+00 -3.44969890e-01 3.48622343e+01
1716.lowfreq: -12.9957 -0.0013 -0.0013 -0.0012 9.8124 17.4462 91.9879 123.3997 177.5108
frequency: 91.9730 123.3812 177.5093 256.1624 291.7414 394.8977 455.0141 465.9590 500.1970 534.5566 821.8121 922.3875 943.0137 999.7639 1041.3000 1045.6616 1083.8088 1158.6558 1196.3904 1213.8529 1243.9503 1308.8539 1328.6770 1372.5643 1395.7562 1405.8433 1458.7014 1468.0571 2950.6481 2959.3086 2983.0658 3023.5316 3075.7219 3527.3809 3547.7753 3594.0733
redmass: 5.0516 2.4760 4.3751 1.1191 2.9926 5.1992 1.3587 1.7384 1.1347 2.8695 3.2461 1.4127 7.1957 4.7960 2.1375 2.6458 1.7862 1.1243 1.2749 1.1633 1.1381 1.2949 1.2703 1.2771 1.2760 1.6092 1.0827 1.0859 1.0666 1.0577 1.0841 1.1066 1.0954 1.0651 1.0652 1.0669
irintensity: 7.5782 4.2624 8.4499 148.7047 10.5760 5.5756 65.5978 148.3535 149.2648 45.9592 29.7864 11.8708 90.9703 34.0601 72.6178 61.9508 10.5981 11.2855 23.2682 2.1925 48.2606 25.7154 33.5340 22.4641 23.7295 3.5833 2.7493 6.6652 23.3388 78.5934 42.5242 69.7562 44.2253 15.6489 22.9547 5.6464
temp: 298.150 k
press: 1.00000 atm
elementType: 8 8 8 6 6 6 1 1 1 1 1 1 1 1
symmnumber: 1
zpe: 301231.3 jmol-1
zpe.correction: 0.114733 hartree
zpe.thermalcorrener: 0.122175 hartree
zpe.thermalcorrenthalpy: 0.123120 hartree
zpe.thermalcorrgfe: 0.083517 hartree
zpe.sumelectzpe: -344.238514 hartree
zpe.sumelectthermal: -344.231071 hartree
zpe.sumelectthermalent: -344.230127 hartree
zpe.sumelectthermalfe: -344.269730 hartree
dipole: 3.9396 -1.5361 1.1093
dipole: 4.3715
quadrupole: -38.4454 -33.5710 -37.7730
quadrupole: -2.9466 1.2558 -0.7487
quadrupole: -1.8489 3.0255 -1.1765 -2.9466 1.2558 -0.7487
hfenergy: -344.3532465 hartree
pointgroup: C01 [X(C3H8O3)]
dipole: -1.5458428 0.6289513 0.4157354 debye
dipolederiv: -0.4152779 0.045336 0.1253041 0.0499732 -0.8281191 0.0835493 0.1273157 0.0922629 -0.5588724 -0.7665815 0.1706109 -0.0545966 0.2060296 -0.4190939 -0.1579647 -0.0936182 -0.1478355 -0.4872022 -0.7165688 -0.2199778 -0.1425722 -0.244237 -0.4445387 0.1238157 -0.1607725 0.1075844 -0.495715 0.1103112 0.0275251 -0.0559002 0.0151243 0.5011606 -0.1536369 -0.0549642 -0.1273772 0.3926536 0.477661 -0.1957341 -0.0511523 -0.0940495 0.388639 0.0937935 -0.0152361 0.0593872 0.3939839 0.5013754 0.2631158 0.0970137 0.1513859 0.2873137 -0.0294493 0.0885484 -0.0476019 0.3375846 0.0498768 0.0043864 -0.0137532 0.0022331 -0.0180772 -0.026131 -0.009811 0.0217742 -0.1918512 -0.0155946 0.042024 0.0511744 0.0270877 0.0294597 -0.0536803 0.028369 -0.1215961 -0.2143837 0.0631559 0.0063417 0.0128872 0.0095124 -0.1083389 0.0717537 0.008389 0.1203471 0.030498 0.0092293 0.0049083 -0.0319978 -0.0283072 -0.1751032 0.0863737 -0.0257717 0.1238665 0.011275 0.0008662 -0.044922 -0.0289985 -0.0529464 0.0278479 -0.0383939 -0.0159583 -0.0953432 -0.1834126 0.1803422 -0.1157303 -0.0689678 -0.0988125 0.3625157 0.020309 -0.0769564 0.0167181 0.3347071 0.3947452 -0.0630714 0.0718947 -0.0523229 0.159898 0.0839364 0.0862071 0.0918704 0.3012521 0.1264595 0.0751874 0.0896645 0.1093294 0.2364363 -0.1042751 0.1142592 -0.094057 0.3294828 unknown
polarizability: 52.3555529|0.0836365|44.0768198|-1.4328088|-0.4867427|34.9294325 unknown
InChI: InChI=1S/C3H8O3/c4-1-3(6)2-5/h3-6H,1-2H2
charge 0 multiplicity 1
14 atoms
O  0.140717 -1.254551 0.538877
O  2.50651 -0.019262 -0.144457
O  -2.319059 -0.166842 -0.049029
C  0.049272 0.047481 -0.148261
C  1.342547 0.780527 0.23171
C  -1.22732 0.770947 0.285788
H  0.020626 -0.117168 -1.245895
H  1.337995 0.986378 1.324487
H  1.434345 1.731908 -0.319176
H  -1.338571 1.727872 -0.264668
H  -1.199596 0.967947 1.377877
H  -0.734972 -1.707116 0.424071
H  2.32592 -0.941858 0.178214
H  -3.178815 0.165639 0.307862
