program: Gaussian 09
title: 000235713
version: EM64L-G09RevD.01
frameworkgroup: C1[X(C7H6N2O4)]
method: RPBEPBE
basis: SDD
operation: Freq
keyword: #pfreq=noraman
keyword: PBEPBE/SDD
title: #p freq=noraman PBEPBE/SDD
converged: YES YES NO NO
title: Mulliken charges:
elementType: O O O O N N C C C C C C C H H H H H H
charge: -0.421439 -0.246465 -0.196506 -0.179125 0.016815 -0.687068 0.343492 0.175754 0.554764 -0.531585 -0.329748 -0.430604 0.121715 0.267154 0.274889 0.234099 0.321457 0.323604 0.388795
chargesum: 0.00000
title: Mulliken charges with hydrogens summed into heavy atoms:
elementType: O O O O N N C C C C C C C
charge: -0.032643 -0.246465 -0.196506 -0.179125 0.016815 -0.042007 0.343492 0.175754 0.554764 -0.264431 -0.054858 -0.196505 0.121715
polarizability: 1.62668448e+02 -5.85446554e+00 1.19473618e+02 4.36968225e+00 -8.08970894e+00 5.27340772e+01
1716.lowfreq: -4.6781 -0.0011 -0.0010 -0.0004 5.3292 8.3256 38.2064 90.8474 92.3965
frequency: 38.1978 90.8460 92.3955 145.8733 184.3805 197.8888 253.2248 317.1429 358.7123 371.4037 398.5016 419.2344 444.0538 466.4349 527.1350 550.9598 566.6169 616.8507 659.8818 676.5625 699.8789 731.6360 753.2879 761.4820 841.5686 886.3361 919.6628 978.2401 1012.0573 1040.3173 1058.5532 1152.9623 1175.1582 1228.9078 1260.3070 1319.5162 1344.0658 1385.9228 1390.4638 1452.4949 1518.3571 1560.4850 1631.0219 1638.2521 1653.7029 3138.7269 3160.8707 3166.9406 3537.5445 3559.8236 3698.3133
redmass: 12.9888 8.2517 6.3062 5.7411 9.0510 5.8780 5.1071 7.2191 5.0214 7.6944 4.4416 1.0480 2.4755 1.4413 2.9519 2.4237 2.5258 3.9527 8.0550 3.3084 6.9885 5.8333 9.0222 4.0544 1.5352 1.7505 4.4887 1.3734 5.7167 1.5005 2.5070 1.4053 1.5878 9.9118 1.4785 2.0671 4.1519 6.4154 5.9981 5.0746 3.8826 7.4143 8.1005 3.0353 1.5178 1.0893 1.0922 1.0960 1.0643 1.0455 1.1041
irintensity: 2.2315 2.9391 0.5826 0.5777 3.1963 1.1007 0.3872 1.5475 4.1383 2.8613 3.9006 2.9789 85.1226 241.0067 39.2607 66.6379 17.1920 36.8071 3.3529 30.0220 18.4608 14.3913 33.2108 2.1254 40.6808 35.2506 2.2080 1.0672 158.8595 3.3023 122.5439 27.8772 36.6057 161.4071 31.3902 37.4692 199.9676 95.7190 73.3003 5.9379 44.3381 10.9290 537.2272 39.8975 266.4631 9.1267 1.0762 6.2077 54.6908 123.3685 29.4652
temp: 298.150 k
press: 1.00000 atm
elementType: 8 8 8 8 7 7 6 6 6 6 6 6 6 1 1 1 1 1 1
symmnumber: 1
zpe: 341134.0 jmol-1
zpe.correction: 0.129931 hartree
zpe.thermalcorrener: 0.141425 hartree
zpe.thermalcorrenthalpy: 0.142369 hartree
zpe.thermalcorrgfe: 0.091976 hartree
zpe.sumelectzpe: -679.733371 hartree
zpe.sumelectthermal: -679.721877 hartree
zpe.sumelectthermalent: -679.720933 hartree
zpe.sumelectthermalfe: -679.771326 hartree
dipole: -6.7114 -1.5530 -0.9367
dipole: 6.9521
quadrupole: -48.2092 -82.2425 -79.0484
quadrupole: -0.3115 -4.6383 2.9966
quadrupole: 21.6241 -12.4091 -9.2150 -0.3115 -4.6383 2.9966
hfenergy: -679.8633019 hartree
pointgroup: C01 [X(C7H6N2O4)]
dipole: -2.6672511 0.5671612 0.212909 debye
dipolederiv: -0.7999998 0.2428414 -0.3616508 0.3514493 -0.509049 0.2274368 -0.5144916 0.1455297 -0.6709258 -0.8295176 -0.3557641 0.0476097 -0.3870815 -0.8584179 0.2741853 -0.0183521 0.1785173 -0.4860985 -0.3662218 0.0802408 0.1164576 0.0573216 -0.7086527 0.2929037 0.1324718 0.1647185 -0.4630057 -0.5698188 0.0980845 0.2806719 0.1774503 -0.4280248 0.027516 0.2156549 0.1136458 -0.4749816 0.8331148 -0.4020722 -0.4299907 -0.3816237 1.1212989 -0.3638487 -0.3133716 -0.2956226 0.7530248 -1.6639108 -0.322108 0.0102102 -0.3431387 -0.1818825 -0.0910172 0.0208944 -0.0882395 -0.7026771 0.3271704 0.4631961 0.0350056 0.4096947 0.1218242 0.0776696 -0.1197083 -0.0050338 0.0270847 -0.9865987 -0.1820402 -0.0673807 -0.2399139 -0.2425671 0.034677 0.0310844 -0.0380197 -0.0603926 1.8051493 0.3795185 -0.0135553 0.3059234 0.0502876 0.0252719 -0.0325628 0.0385636 0.1742799 -0.6266599 -0.3338973 0.0203476 0.3580863 -0.0069093 -0.0242152 -0.1142551 0.0099628 -0.1794786 0.3985488 0.0216199 0.0308234 -0.0720462 0.0836265 -0.032 0.1159536 -0.0029021 -0.0580385 -0.3475998 -0.0997658 0.0060489 -0.5274499 -0.0817609 -0.042965 0.067351 -0.0181768 -0.2135791 1.9735568 0.4351062 0.3447632 0.3114354 1.0710925 -0.5638653 0.4083993 -0.3779479 0.7349831 0.0642622 -0.0345782 -0.007166 -0.0405387 0.0101331 0.0098042 0.0463028 0.0047187 0.171582 0.1093997 -0.0448379 0.0025183 -0.0114956 0.0029078 0.0113838 -0.0186062 0.0176361 0.1461151 -0.0434341 0.0951187 -0.0216713 0.08123 0.0099667 0.0209632 -0.0181244 0.0130778 0.1673553 0.2630842 0.0082402 -0.0009277 -0.0465053 0.120864 0.0353224 0.0016477 0.0346519 0.3842234 0.2271159 0.0384104 -0.0098994 0.1002516 0.1660447 0.0360579 -0.0129428 0.0359485 0.3821206 0.2323589 -0.0873131 0.0177855 -0.103049 0.2592181 0.0447197 0.1226548 0.0689718 0.3684085 unknown
polarizability: 162.4996234|7.2185408|117.597784|-0.7139633|-14.3555962|54.7787352 unknown
InChI: InChI=1S/C7H6N2O4/c8-4-1-2-5(7(10)11)6(3-4)9(12)13/h1-3,10H,8H2
charge 0 multiplicity 1
19 atoms
O  2.541966 0.446874 0.930555
O  2.227036 2.333175 -0.390915
O  0.600408 -2.675215 0.877492
O  1.832196 -1.657497 -0.752321
N  0.859881 -1.688103 0.087655
N  -3.779375 -0.175544 -0.007815
C  -0.084236 -0.53403 0.097029
C  0.369478 0.806868 -0.020705
C  -2.431371 0.144596 -0.025004
C  -1.444017 -0.873921 0.113516
C  -0.629123 1.803264 -0.186816
C  -1.995721 1.493747 -0.196922
C  1.774914 1.272328 0.104656
H  -1.727911 -1.92627 0.21235
H  -0.295622 2.840633 -0.291914
H  -2.735425 2.292177 -0.323407
H  -4.487591 0.544357 -0.122781
H  -4.089481 -1.134658 0.123215
H  3.481293 0.77232 0.945932
