program: Gaussian 09
title: 000235711
version: EM64L-G09RevD.01
frameworkgroup: C1[X(C18H32O2)]
method: RPBEPBE
basis: SDD
operation: Freq
keyword: #pfreq=noraman
keyword: PBEPBE/SDD
title: #p freq=noraman PBEPBE/SDD
converged: YES YES NO NO
title: Mulliken charges:
elementType: O O C C C C C C C C C C C C C C C C C C H H H H H H H H H H H H H H H H H H H H H H H H H H H H H H H H
charge: -0.415164 -0.235794 -0.387155 -0.392091 -0.381142 -0.379677 -0.372324 -0.374564 -0.353441 -0.375679 -0.356428 -0.489815 -0.697150 -0.366333 -0.018936 -0.367424 -0.483005 -0.491279 -0.041104 0.193380 0.187319 0.190722 0.184088 0.231349 0.191459 0.187624 0.191459 0.179637 0.188927 0.188231 0.240601 0.181603 0.187968 0.184717 0.204134 0.195490 0.194143 0.195081 0.225801 0.227357 0.208600 0.214498 0.209822 0.230823 0.192715 0.199654 0.246737 0.221695 0.232367 0.241625 0.254283 0.374592
chargesum: 0.00000
title: Mulliken charges with hydrogens summed into heavy atoms:
elementType: O O C C C C C C C C C C C C C C C C C C
charge: -0.040571 -0.235794 -0.009113 0.023346 -0.002059 -0.008581 0.004835 0.047640 0.019244 0.023945 0.032797 -0.036657 -0.064229 0.057205 -0.018936 0.078967 -0.028942 0.004630 -0.041104 0.193380
polarizability: 2.32707921e+02 -2.20827919e+00 2.13146931e+02 3.42322307e-01 -3.41789752e+00 1.55358646e+02
1716.lowfreq: -3.4726 -2.8370 -0.0009 0.0003 0.0008 7.4316 11.8693 16.4751 29.3859
frequency: 11.5079 16.1996 29.1812 31.4799 35.8399 39.7062 46.6934 53.4078 72.7140 85.7654 92.3034 105.3400 115.7623 120.8694 143.3569 147.3651 158.9077 160.2828 192.7941 203.7436 230.0965 238.2612 246.6161 258.8573 286.1585 310.1978 347.9578 359.3617 391.1588 437.8727 469.8465 483.7967 501.8986 521.0962 556.4634 595.8045 648.4692 674.4108 720.5167 725.6475 733.1421 752.5193 759.6922 787.5862 799.3487 830.2445 842.8543 858.0036 885.3272 887.1485 904.6242 943.0276 973.6039 982.5470 997.7610 1005.4053 1019.4452 1025.7267 1035.3421 1040.1396 1060.5998 1066.1123 1078.1456 1079.1858 1080.3537 1082.1814 1091.3609 1109.2849 1121.0805 1160.0788 1168.4288 1176.4053 1182.3350 1189.0706 1207.9361 1218.5721 1238.5851 1240.2085 1249.2272 1253.4401 1265.2643 1275.5357 1276.8524 1284.2915 1286.2187 1286.4548 1294.1862 1298.6271 1308.0758 1311.5441 1317.0043 1326.0807 1330.2568 1347.3880 1351.6614 1357.3034 1359.2912 1363.8640 1365.8101 1387.5091 1438.2423 1456.7405 1458.7313 1459.1653 1460.3742 1460.6359 1461.9537 1463.7279 1465.4519 1471.0544 1471.7032 1477.2956 1477.7134 1482.2306 1487.3373 1489.9541 1663.5709 2274.3271 2944.0804 2947.0779 2948.3556 2950.2247 2956.0051 2958.4431 2961.4854 2962.4580 2963.1481 2967.0078 2970.4278 2970.8802 2975.9584 2980.7490 2983.7806 2987.6664 2991.8523 2995.5251 3000.8515 3009.6914 3012.1903 3016.6283 3020.9060 3032.2898 3035.9382 3040.1250 3050.1193 3051.5918 3067.2173 3067.2519 3069.1486 3508.1831
redmass: 4.6739 4.5904 4.8270 5.3993 3.4273 2.4984 3.0280 3.1518 2.9125 1.9749 3.4561 3.0697 2.0393 2.1932 2.2142 2.6776 2.3876 2.1269 3.3422 3.4237 2.5756 1.1029 2.3401 2.5866 3.2764 3.5828 3.4724 3.6253 3.0344 3.7901 3.7190 2.9584 2.0481 3.1961 3.3629 2.6810 1.3934 2.2442 1.0612 1.0699 1.0991 1.2703 1.5981 1.2801 2.3105 1.4371 2.0486 1.4505 1.7616 1.8925 1.3710 1.9180 1.3940 3.1181 3.4665 3.0237 1.1734 3.0062 2.9566 1.9154 2.6798 2.7990 2.2074 2.0666 2.4274 2.3606 1.9105 1.5229 2.6140 2.3615 1.3858 1.1903 1.7246 1.2968 1.4943 1.3369 1.3446 1.2702 1.2929 1.6386 1.2831 1.2202 1.0650 1.2309 1.0711 1.1732 1.0880 1.1954 1.2152 1.2256 1.3508 1.4240 1.4343 1.5114 1.7237 1.6327 1.5887 1.7799 1.5099 1.2179 1.0905 1.0878 1.0745 1.0753 1.0740 1.0848 1.0784 1.0725 1.0665 1.0828 1.0920 1.0500 1.0763 1.0879 1.0870 1.0983 8.0283 11.6804 1.0589 1.0587 1.0589 1.0593 1.0609 1.0620 1.0609 1.0603 1.0612 1.0585 1.0368 1.0621 1.0622 1.0960 1.0633 1.0973 1.0935 1.0638 1.1015 1.0986 1.0987 1.1021 1.1001 1.1041 1.0969 1.1041 1.1035 1.0981 1.1007 1.1008 1.0994 1.0639
irintensity: 0.0170 0.0197 0.8197 0.2616 0.2776 0.0696 0.1624 0.2592 0.2007 0.2276 0.0191 0.3001 0.2435 0.6091 0.8961 2.6104 1.5657 0.7220 0.4457 0.0916 2.4534 0.0023 6.8048 0.9083 1.3683 0.9076 3.0404 0.2720 1.0108 15.6670 10.5126 0.1587 27.8787 6.9141 6.0628 6.2382 122.4100 0.2413 14.2647 2.5031 11.1099 4.1166 6.2795 2.1039 1.7900 1.0382 0.9014 2.0233 11.0263 4.8717 0.7042 1.2728 0.0228 1.9274 1.0808 1.0458 0.6374 136.7840 11.7270 85.9601 2.5576 1.7388 0.5360 1.7416 28.1547 3.2292 39.2798 1.0583 9.9507 5.0173 7.5665 1.5454 0.7087 9.9746 2.6292 1.9032 0.3838 1.8804 0.8245 5.3001 0.0936 0.0620 0.5119 5.9078 1.4200 1.2215 0.1604 0.2577 0.0679 4.0657 5.0658 7.9313 4.8257 0.8568 0.8536 0.6258 3.8792 35.4405 7.4533 11.2626 37.5507 6.1777 1.1692 1.8742 0.0625 9.7645 1.1175 0.4656 0.8223 3.5580 16.2084 10.2430 2.6875 1.2379 5.9699 28.1181 242.1919 1.6245 4.8085 14.4724 0.3962 2.1493 11.1586 5.6798 30.1708 52.2906 47.6193 147.8483 37.7815 95.0654 41.7964 0.6305 27.8908 5.2156 23.4855 23.1324 0.5394 24.4293 23.1590 2.3698 12.4337 39.2473 9.7432 57.7908 194.5887 17.1559 130.8805 16.5552 57.8947 18.0767
temp: 298.150 k
press: 1.00000 atm
elementType: 8 8 6 6 6 6 6 6 6 6 6 6 6 6 6 6 6 6 6 6 1 1 1 1 1 1 1 1 1 1 1 1 1 1 1 1 1 1 1 1 1 1 1 1 1 1 1 1 1 1 1 1
symmnumber: 1
zpe: 1209391.5 jmol-1
zpe.correction: 0.460633 hartree
zpe.thermalcorrener: 0.486272 hartree
zpe.thermalcorrenthalpy: 0.487216 hartree
zpe.thermalcorrgfe: 0.399266 hartree
zpe.sumelectzpe: -853.900879 hartree
zpe.sumelectthermal: -853.875240 hartree
zpe.sumelectthermalent: -853.874296 hartree
zpe.sumelectthermalfe: -853.962247 hartree
dipole: 0.4783 1.5944 0.4917
dipole: 1.7357
quadrupole: -124.1668 -118.6454 -124.2906
quadrupole: 5.8880 2.5604 0.3742
quadrupole: -1.7992 3.7222 -1.9230 5.8880 2.5604 0.3742
hfenergy: -854.361512 hartree
pointgroup: C01 [X(C18H32O2)]
dipole: -0.1899106 0.6277504 -0.190258 debye
polarizability: 232.6865909|2.26796|213.1194439|0.6403588|3.7892644|155.4074635 unknown
InChI: InChI=1S/C18H32O2/c1-2-3-4-5-6-7-8-9-10-11-12-13-14-15-16-17-18(19)20/h19H,2-11,14-17H2,1H3
charge 0 multiplicity 1
52 atoms
O  -0.49333 3.810953 0.07829
O  -0.839177 1.519365 0.155409
C  2.561378 -1.417372 -0.462464
C  1.190965 -1.473928 0.249024
C  3.631143 -0.632054 0.329551
C  0.124034 -2.262102 -0.54426
C  5.00173 -0.571869 -0.381945
C  -1.246944 -2.302398 0.166747
C  6.072693 0.21266 0.409245
C  -2.319772 -3.069004 -0.636227
C  7.442653 0.270772 -0.304683
C  -3.705606 -3.125886 0.072008
C  8.507721 1.053927 0.493248
C  -4.242021 1.796597 0.570431
C  -4.312265 -1.795598 0.279549
C  -3.597017 1.887356 -0.829758
C  -5.331083 0.688459 0.662651
C  -2.521744 2.988728 -0.93169
C  -4.796262 -0.670915 0.447061
C  -1.243976 2.652756 -0.184595
H  2.927447 -2.450215 -0.644112
H  2.434523 -0.953079 -1.46335
H  1.318496 -1.937752 1.250134
H  0.817692 -0.445006 0.422316
H  3.75798 -1.095137 1.33076
H  3.264892 0.400422 0.510865
H  0.000341 -1.797164 -1.545092
H  0.483939 -3.298127 -0.722927
H  5.365402 -1.605322 -0.562832
H  4.874415 -0.10932 -1.38348
H  -1.591733 -1.265611 0.346745
H  -1.13031 -2.775284 1.16504
H  6.201858 -0.250017 1.41037
H  5.711256 1.246926 0.590736
H  -2.443177 -2.598417 -1.631906
H  -1.98047 -4.1103 -0.813156
H  7.312395 0.734065 -1.304253
H  7.80144 -0.762998 -0.486938
H  -3.588384 -3.631165 1.052632
H  -4.396785 -3.755147 -0.524115
H  8.184828 2.098318 0.665267
H  9.475927 1.08297 -0.040085
H  8.680627 0.59044 1.483096
H  -3.460057 1.592372 1.326203
H  -4.709484 2.768301 0.83054
H  -4.383491 2.091535 -1.583023
H  -3.148695 0.909428 -1.084266
H  -6.128264 0.898722 -0.079983
H  -5.813139 0.738699 1.659382
H  -2.893542 3.963839 -0.567228
H  -2.233319 3.148647 -1.990717
H  0.354472 3.555027 0.534383
