program: Gaussian 09
title: 000235701
version: EM64L-G09RevD.01
frameworkgroup: C1[X(C20H36N2O2)]
method: RPBEPBE
basis: SDD
operation: Freq
keyword: #p
keyword: freq=noraman
keyword: PBEPBE/SDD
title: #p freq=noraman PBEPBE/SDD
converged: NO YES NO NO
title: Mulliken charges:
elementType: O O N N C C C C C C C C C C C C C C C C C C C C H H H H H H H H H H H H H H H H H H H H H H H H H H H H H H H H H H H H
charge: -0.483099 -0.456434 -0.105394 -0.158231 0.256622 -0.173871 -0.479968 -0.470221 -0.175174 -0.532791 -0.497494 -0.389979 -0.034685 0.029553 -0.458105 -0.429449 -0.449977 -0.450809 -0.391424 -0.385650 -0.401017 -0.402274 -0.383176 -0.383609 0.253305 0.250771 0.186649 0.218036 0.224496 0.245682 0.231515 0.260296 0.222996 0.219139 0.193997 0.225980 0.263999 0.172325 0.189042 0.198458 0.189193 0.192985 0.202550 0.215492 0.209784 0.202530 0.354070 0.213476 0.184820 0.182252 0.221553 0.199695 0.190762 0.191338 0.199972 0.183028 0.192767 0.334716 0.198572 0.190420
chargesum: 0.00000
title: Mulliken charges with hydrogens summed into heavy atoms:
elementType: O O N N C C C C C C C C C C C C C C C C C C C C
charge: -0.129029 -0.121718 -0.105394 -0.158231 0.256622 0.079434 -0.042549 -0.027689 0.070508 -0.040980 -0.055360 0.029997 0.229314 0.201877 -0.070605 -0.047270 -0.031935 -0.038496 0.006872 0.018155 -0.010560 -0.010964 -0.007381 0.005383
polarizability: 2.75185574e+02 -2.16537525e+00 2.21812209e+02 -1.92856359e+00 3.33370602e+00 1.86909010e+02
1716.lowfreq: -19.1670 -9.7582 -5.2997 -0.0009 -0.0007 0.0004 16.6368 20.1985 26.2585
frequency: 15.6300 17.1976 25.9491 43.9706 53.2836 69.5008 80.5490 106.9417 113.4943 132.9104 153.8091 167.3082 191.1971 210.2268 215.8032 254.2487 264.9431 278.8177 288.6411 301.9311 330.4257 342.0867 352.1295 362.8119 375.3289 389.2929 400.1634 417.7001 433.3168 443.7403 453.4371 473.7430 478.3854 491.4745 515.1932 555.1112 566.8149 595.8587 672.9309 675.2186 706.7243 752.1363 773.5644 775.6120 783.6192 785.5489 808.0246 813.0289 839.8078 859.7650 863.0611 864.0262 868.1411 878.5091 886.0072 893.5702 915.7900 921.2834 922.6713 931.2810 958.5394 976.8012 980.2064 982.0925 1001.4811 1006.0266 1011.7607 1037.8520 1045.1538 1050.2736 1054.7735 1056.1013 1061.1545 1072.0158 1079.7309 1087.0081 1088.0200 1107.6630 1110.3219 1116.4758 1117.7347 1127.0066 1138.1910 1147.1300 1158.2120 1171.8424 1180.2500 1184.4156 1197.7049 1200.3503 1215.3508 1234.2645 1237.0750 1241.4533 1246.1776 1254.2073 1257.9213 1261.3374 1263.7698 1267.9617 1273.8655 1285.4010 1297.6056 1302.6120 1304.1802 1309.9844 1312.7842 1317.8725 1328.5593 1330.3702 1331.7530 1332.9892 1339.6610 1340.1884 1341.4407 1342.3886 1350.3739 1354.4356 1362.8823 1368.8861 1372.7314 1373.9010 1398.1353 1451.1343 1457.4448 1458.1205 1460.4213 1461.1133 1461.2685 1462.6164 1463.5934 1465.0562 1466.8793 1470.6775 1473.5269 1478.2196 1491.8258 1494.7618 2805.9147 2864.3443 2883.4805 2912.4957 2954.6215 2964.7361 2965.0947 2966.4617 2968.9708 2969.5339 2972.8596 2974.7984 2977.5126 2980.0922 2980.6629 2983.5125 2987.3342 3003.0842 3018.9327 3020.6923 3027.6967 3029.2722 3030.0250 3030.0525 3036.4712 3037.9104 3039.5284 3047.3015 3048.6970 3051.8372 3076.0682 3081.8201 3089.7921 3094.8662 3429.2478 3563.5878
redmass: 3.8638 3.3989 3.0310 3.7400 4.1504 3.8374 3.4179 2.6665 3.3393 2.5445 4.2084 2.4259 4.1702 1.8032 4.0606 2.5284 2.3861 1.2493 2.3652 2.3129 3.0775 1.9927 2.9357 3.0093 2.5343 3.3141 2.0647 2.4112 3.0764 2.7421 2.4479 2.1941 1.7795 2.1065 2.6130 3.3443 1.1260 3.0986 3.3558 2.9211 3.4974 3.2117 3.3334 1.5450 1.7645 1.8643 3.0782 1.7991 2.2136 2.0932 1.5606 2.4759 2.5873 2.5779 2.0881 1.4552 2.4119 1.7982 1.6379 2.3482 2.1830 1.9462 2.6086 2.5399 2.4886 2.5410 2.3394 2.7810 1.7712 1.4539 1.7785 1.8170 1.7058 2.0338 1.5757 2.1874 2.2586 1.8295 2.3855 1.3119 1.7419 2.3028 2.1308 2.3228 1.3592 2.5914 1.5367 1.2765 1.4760 1.3408 1.3697 1.3548 1.2560 1.3130 1.2583 1.2762 1.2402 1.2073 1.2947 1.4028 1.2296 1.3510 1.5509 1.2615 1.2360 1.3977 1.6511 1.2860 1.3678 1.3636 1.4952 1.4281 1.3941 1.3901 1.5429 1.4846 1.4275 1.4307 1.3958 1.3356 1.5886 1.5262 1.9171 1.0859 1.0871 1.0845 1.0892 1.0856 1.0880 1.0912 1.0857 1.0917 1.0880 1.0823 1.0950 1.0947 1.0930 1.0838 1.0798 1.0703 1.0716 1.0827 1.0623 1.0711 1.0633 1.0630 1.0615 1.0627 1.0609 1.0616 1.0620 1.0729 1.0618 1.0665 1.0804 1.0808 1.0983 1.0963 1.0967 1.0920 1.0733 1.0888 1.1001 1.1029 1.1014 1.1007 1.1022 1.0923 1.0911 1.0956 1.0942 1.1039 1.0644 1.0661
irintensity: 0.1019 0.2193 0.1782 0.5890 0.2949 0.3606 0.7904 0.5834 0.0530 0.5095 0.6739 0.6171 1.2288 0.2522 4.9226 2.9571 1.8708 94.2252 25.7947 7.6166 16.7215 5.5551 4.3362 7.1290 2.0192 1.3497 2.3806 7.5029 1.2104 6.2664 0.8263 2.3772 0.4836 0.5953 3.2364 3.9435 69.8263 15.1611 2.4951 19.2965 13.8295 3.1048 3.9789 2.1672 1.5026 3.6952 0.3817 2.0374 9.8901 25.2219 6.9003 2.0387 3.0365 5.7212 0.2517 9.2597 10.3426 5.1742 2.4616 5.3656 36.7406 25.2786 53.0879 5.1080 10.4765 17.1894 2.1056 12.5513 0.6402 1.5803 0.6534 2.1673 4.4766 6.0839 9.5853 25.0491 14.0742 18.5165 14.7970 4.9614 2.0572 26.0413 29.4708 3.6140 2.3374 45.9444 24.4547 16.7464 2.0051 27.7423 3.5837 22.3156 27.8214 2.9745 27.4125 2.9543 3.1493 0.8637 2.7465 11.7531 2.8308 12.2556 1.2069 8.5683 1.0295 8.2078 2.1265 0.4215 4.7405 2.3957 7.5639 0.8663 0.2378 1.7657 2.0616 0.3385 4.2014 1.0618 4.3487 7.2341 48.7392 9.8900 33.0111 4.8758 12.3242 3.6400 6.3658 4.7366 1.8803 5.4726 20.5197 10.4863 2.9389 19.8725 12.2292 1.5933 7.3677 8.0948 70.5844 62.5022 100.2451 13.5754 43.8302 35.7086 38.1788 42.2407 10.7154 35.7647 14.8049 64.0771 31.0829 33.3361 75.5605 13.5523 24.4198 55.2021 86.7356 65.7367 73.7568 93.0266 8.7260 21.7272 11.7868 17.1599 1.9591 101.5630 137.5648 41.6575 14.9716 25.5502 27.5751 21.7054 40.5154 4.7092
temp: 298.150 k
press: 1.00000 atm
elementType: 8 8 7 7 6 6 6 6 6 6 6 6 6 6 6 6 6 6 6 6 6 6 6 6 1 1 1 1 1 1 1 1 1 1 1 1 1 1 1 1 1 1 1 1 1 1 1 1 1 1 1 1 1 1 1 1 1 1 1 1
symmnumber: 1
zpe: 1409789.9 jmol-1
zpe.correction: 0.536961 hartree
zpe.thermalcorrener: 0.560873 hartree
zpe.thermalcorrenthalpy: 0.561817 hartree
zpe.thermalcorrgfe: 0.481849 hartree
zpe.sumelectzpe: -1041.710440 hartree
zpe.sumelectthermal: -1041.686527 hartree
zpe.sumelectthermalent: -1041.685583 hartree
zpe.sumelectthermalfe: -1041.765551 hartree
dipole: 2.3177 0.7168 0.6077
dipole: 2.5010
quadrupole: -142.7287 -146.0837 -149.0223
quadrupole: -5.9723 -4.8993 3.5544
quadrupole: 3.2162 -0.1388 -3.0774 -5.9723 -4.8993 3.5544
hfenergy: -1042.2474003 hartree
pointgroup: C01[X(C20H36N2O2)]
dipole: 0.909224 0.3366185 0.1679006 debye
polarizability: 275.2072024|-2.4771992|221.0022828|0.0509885|-6.2532794|187.6973079 unknown
InChI: InChI=1S/C20H36N2O2/c23-19-14-22(17-9-5-2-6-10-17)13-18(19)20(24)11-12-21(15-20)16-7-3-1-4-8-16/h16-19,23-24H,1-15H2
charge 0 multiplicity 1
60 atoms
O  -0.007184 0.440495 0.97327
O  -1.686973 3.186769 -1.624423
N  -3.038496 -0.190764 -0.81529
N  2.65142 0.439108 0.061775
C  0.400346 0.910103 -0.374674
C  -0.851078 0.908681 -1.263158
C  1.557536 -0.000091 -0.852817
C  -1.637051 -0.456226 -1.289981
C  -1.917201 1.953158 -0.846264
C  1.116131 2.291398 -0.252097
C  -3.252601 1.233014 -1.179189
C  2.61441 1.940692 -0.011084
C  -3.258761 -0.592945 0.622727
C  3.995361 -0.155921 -0.176998
C  -4.537024 0.032179 1.23795
C  -3.388407 -2.141815 0.694714
C  5.007467 0.354584 0.88011
C  3.944927 -1.704532 -0.155784
C  -5.838574 -0.452598 0.555491
C  -4.6748 -2.653279 0.00539
C  6.411325 -0.262909 0.681164
C  5.348232 -2.3266 -0.354176
C  -5.94033 -1.996417 0.607309
C  6.356601 -1.807698 0.696008
H  -0.533797 1.183954 -2.288775
H  1.322853 -1.067555 -0.716819
H  1.794809 0.18938 -1.930108
H  -1.666676 -0.852544 -2.323013
H  -1.154937 -1.204452 -0.64103
H  -1.85277 2.164128 0.241039
H  0.672213 2.865065 0.577775
H  0.977607 2.880441 -1.173802
H  -4.134455 1.665613 -0.682183
H  -3.409151 1.306166 -2.276115
H  3.243215 2.309446 -0.857585
H  3.009976 2.380672 0.919498
H  -2.38512 -0.284059 1.241669
H  4.369849 0.160719 -1.189566
H  -4.480032 1.137849 1.243267
H  -4.558173 -0.271557 2.304911
H  -3.389758 -2.436966 1.764933
H  -2.500955 -2.620258 0.237677
H  4.617557 0.091572 1.884511
H  5.082467 1.457264 0.838109
H  3.267115 -2.079783 -0.945507
H  3.522745 -2.026006 0.81826
H  0.855381 0.247228 1.438841
H  -5.847163 -0.126462 -0.502925
H  -6.717627 0.007629 1.048802
H  -4.737949 -3.756147 0.091085
H  -4.614636 -2.404145 -1.071447
H  7.095827 0.106885 1.46885
H  6.828731 0.077742 -0.289346
H  5.71949 -2.075453 -1.369645
H  5.274307 -3.430185 -0.30663
H  -6.05627 -2.317985 1.664205
H  -6.844342 -2.339382 0.066696
H  -2.319136 3.883698 -1.315672
H  7.361824 -2.230777 0.505136
H  6.046105 -2.15322 1.703633
