program: Gaussian 09
title: 000235700
version: EM64L-G09RevD.01
frameworkgroup: C1[X(C7H12O)]
method: RPBEPBE
basis: SDD
operation: Freq
keyword: #pfreq=noraman
keyword: PBEPBE/SDD
title: #p freq=noraman PBEPBE/SDD
converged: YES YES NO NO
title: Mulliken charges:
elementType: O C C C C C C C H H H H H H H H H H H H
charge: -0.284689 -0.146103 -0.092373 -0.447019 -0.439107 -0.348042 -0.398194 -0.384581 0.232777 0.230775 0.209206 0.199273 0.217983 0.228538 0.196788 0.216976 0.195377 0.210511 0.194789 0.207117
chargesum: 0.00000
title: Mulliken charges with hydrogens summed into heavy atoms:
elementType: O C C C C C C C
charge: -0.284689 0.086674 0.138402 -0.038540 0.007414 0.065721 0.007693 0.017325
polarizability: 7.66817290e+01 2.23944110e+00 7.38045558e+01 1.12667723e+00 1.98688716e+00 6.45503431e+01
1716.lowfreq: -27.7658 -12.0249 -0.0007 0.0002 0.0008 13.4264 83.9872 140.7642 279.1130
frequency: 83.4787 140.6805 279.0865 337.3076 376.6672 426.8627 450.2725 593.7128 664.1753 759.9791 788.9603 819.1206 852.3652 885.1478 908.4038 914.2583 932.7366 986.7758 1007.3040 1062.7959 1071.6201 1088.2671 1114.5707 1124.5825 1154.9425 1171.4990 1223.9103 1242.8576 1259.2882 1280.8613 1289.1304 1318.5888 1322.9721 1330.1996 1344.3315 1347.4904 1363.3493 1459.9659 1465.4802 1470.4603 1473.1952 1487.3401 2966.0537 2968.9737 2971.0165 2978.1048 2987.9157 3014.9204 3019.1857 3029.6253 3035.7655 3039.1378 3055.7334 3067.0661
redmass: 2.7375 2.1773 2.0799 1.7648 2.9928 3.7280 2.7406 2.1635 2.5441 2.6042 1.9852 2.2951 2.5826 1.9180 7.0808 2.0220 1.9341 1.7464 1.9032 1.9382 1.5850 1.2359 1.5250 1.2502 2.1214 1.4649 1.3679 1.3630 1.2801 1.3594 1.3012 1.3556 1.3140 1.6685 1.5529 1.4478 1.4489 1.0826 1.0858 1.0836 1.0929 1.0958 1.0597 1.0674 1.0608 1.0623 1.0615 1.0878 1.0982 1.0908 1.0967 1.1013 1.1015 1.1042
irintensity: 3.7823 1.1126 1.0577 0.2450 4.9960 0.9522 1.7549 0.6134 1.0376 1.3037 23.3340 11.9047 5.2468 4.8829 36.0949 19.8145 5.0969 1.1105 2.2291 0.2977 3.8191 0.3766 1.7260 0.5598 1.7342 0.2618 1.0560 0.6011 0.1822 4.6045 2.0214 2.1332 2.9556 0.1640 0.9161 1.0467 0.7776 7.3678 9.6036 11.9838 7.5567 8.5171 34.2907 23.5663 26.1583 85.4459 18.4437 19.3180 29.3700 56.5527 48.2315 49.3808 85.0940 73.8700
temp: 298.150 k
press: 1.00000 atm
elementType: 8 6 6 6 6 6 6 6 1 1 1 1 1 1 1 1 1 1 1 1
symmnumber: 1
zpe: 465398.1 jmol-1
zpe.correction: 0.177261 hartree
zpe.thermalcorrener: 0.184427 hartree
zpe.thermalcorrenthalpy: 0.185371 hartree
zpe.thermalcorrgfe: 0.145830 hartree
zpe.sumelectzpe: -348.482168 hartree
zpe.sumelectthermal: -348.475002 hartree
zpe.sumelectthermalent: -348.474058 hartree
zpe.sumelectthermalfe: -348.513599 hartree
dipole: 2.0734 -1.5176 0.6172
dipole: 2.6425
quadrupole: -54.5160 -48.8675 -47.7967
quadrupole: 4.4548 -1.0219 1.2112
quadrupole: -4.1226 1.5259 2.5967 4.4548 -1.0219 1.2112
hfenergy: -348.6594288 hartree
pointgroup: C01 [X(C7H12O1)]
dipole: -0.844573 -0.5580662 -0.2369397 debye
dipolederiv: -0.6258871 0.10341 -0.0345573 0.0461507 -0.5815367 0.1187933 -0.1669303 0.1143319 -0.4365556 0.0968925 0.02254 -0.0599626 0.0542376 -0.0243132 0.0643324 -0.0525584 0.0395081 0.0626666 0.4110185 -0.2419831 0.020898 -0.104598 0.2546447 -0.0516849 -0.03223 -0.1641344 0.4088662 0.05134 0.0146203 0.0426806 -0.0233847 0.0766069 -0.0267766 0.0451458 0.007907 0.1156537 -0.0970259 0.0398026 0.0330009 0.0262297 0.0422999 -0.0634126 0.0693679 -0.0251269 0.0426305 0.2145529 -0.061304 -0.1221358 -0.2101566 0.4496478 -0.1759692 -0.0201921 -0.0947728 0.2792107 0.0684861 -0.0010157 0.0357818 0.002931 0.0255544 0.0087026 0.0183752 0.0079204 0.1092255 0.0928439 -0.0111386 0.0038946 0.0246774 0.0260357 0.0264937 0.0438569 0.0065791 0.1535821 -0.028644 0.048929 0.0804498 0.040755 0.0023592 -0.0830168 0.0793433 -0.0961971 -0.0911917 0.0141128 0.0062645 0.0494935 0.0055848 -0.0094428 0.0782887 0.0542653 0.0981603 -0.1541972 0.0371488 0.0345864 -0.0066656 0.0125143 -0.1822209 0.0635558 0.0224329 0.1149532 0.0437786 -0.0371017 -0.0343547 -0.0860809 -0.0013403 0.0751153 -0.0160574 -0.0893936 -0.0760471 -0.1409118 0.0366712 -0.0084106 0.0163517 -0.0049389 -0.1901192 0.0699687 0.0119392 0.0994805 0.052104 0.0335403 -0.0080068 -0.0361281 0.0174908 0.086064 0.0209855 -0.0337047 -0.0355997 -0.1196599 0.0225104 -0.0518085 0.1385395 -0.0093907 -0.000655 0.0282417 0.0720167 0.0650616 -0.1690845 -0.1047713 0.133365 -0.0294833 0.1386624 -0.0729168 0.034508 0.019567 -0.00414 0.0726354 0.0606208 0.0242404 -0.1050139 0.0173898 0.0275646 -0.0270013 -0.0542679 -0.0065555 -0.1652264 -0.1871808 -0.0997431 0.0433006 -0.095423 -0.0008576 0.0106183 0.0154519 0.004308 0.0770283 0.0382629 -0.0264618 -0.0530716 -0.0425927 0.0461065 -0.0203557 -0.1096596 0.0219049 -0.1714181 -0.0973901 0.1164688 0.0687082 0.1052013 -0.0499365 -0.0602142 0.1071744 -0.0775416 0.0308634 unknown
polarizability: 76.4034657|-2.3287681|73.9382148|1.2107036|-2.3289402|64.6949474 unknown
InChI: InChI=1S/C7H12O/c1-2-4-7-6(3-1)5-8-7/h6-7H,1-5H2
charge 0 multiplicity 1
20 atoms
O  1.963425 0.592677 0.281059
C  0.545166 -0.874186 -0.522543
C  0.72085 0.683913 -0.603222
C  -0.862106 -1.454785 -0.287347
C  -0.375107 1.538154 0.068584
C  1.581274 -0.82596 0.638373
C  -1.77779 -0.526188 0.546817
C  -1.783149 0.903051 -0.042878
H  1.002135 -1.352087 -1.407772
H  1.00643 1.077109 -1.594679
H  -0.776235 -2.45158 0.190389
H  -1.34642 -1.623062 -1.270885
H  -0.372207 2.560755 -0.352621
H  -0.110783 1.632624 1.139749
H  1.134348 -0.875218 1.65185
H  2.451059 -1.501956 0.57466
H  -1.430063 -0.481453 1.59936
H  -2.80276 -0.94355 0.567193
H  -2.108388 0.863389 -1.103152
H  -2.514779 1.538752 0.491465
