program: Gaussian 09
title: 000235685
version: EM64L-G09RevD.01
frameworkgroup: C1[X(C15H7N5O9S2)]
method: RPBEPBE
basis: SDD
operation: Freq
keyword: #p
keyword: freq=noraman
keyword: PBEPBE/SDD
title: #p freq=noraman PBEPBE/SDD
converged: YES YES NO NO
title: Mulliken charges:
elementType: S S O O O O O O O O O N N N N N C C C C C C C C C C C C C C C H H H H H H H
charge: 0.407811 0.397243 -0.220576 -0.200351 -0.177724 -0.187478 -0.164770 -0.188286 -0.181546 -0.194079 -0.193575 0.098943 0.005757 0.011341 0.025428 0.021379 0.250747 -0.352655 0.578183 0.282530 0.428859 -0.474368 0.425150 -0.478354 -0.179859 -0.258877 -0.368050 -0.365959 0.290659 -0.565670 -0.625678 0.338057 0.333202 0.273210 0.287948 0.304085 0.310463 0.306860
chargesum: 0.00000
title: Mulliken charges with hydrogens summed into heavy atoms:
elementType: S S O O O O O O O O O N N N N N C C C C C C C C C C C C C C C
charge: 0.407811 0.397243 -0.220576 -0.200351 -0.177724 -0.187478 -0.164770 -0.188286 -0.181546 -0.194079 -0.193575 0.098943 0.005757 0.011341 0.025428 0.021379 0.250747 -0.352655 0.578183 0.282530 0.428859 -0.136310 0.425150 -0.145152 0.093351 0.029071 -0.063965 -0.055496 0.290659 -0.565670 -0.318818
polarizability: 3.00341255e+02 -1.78902778e+01 3.98809700e+02 -1.23924823e+01 4.59547002e+00 2.04433298e+02
1716.lowfreq: -6.0546 -2.1791 0.0010 0.0015 0.0018 1.7614 6.1159 11.2094 27.2323
frequency: 5.3407 11.1853 27.2305 30.6016 38.0104 46.2596 50.0661 54.9544 66.6098 76.3731 85.8165 107.3406 143.4455 151.1699 154.0552 155.5869 176.3202 186.8928 198.0747 208.9998 242.2178 265.4627 287.4788 305.8168 308.5153 333.8237 342.9643 350.6821 359.9417 393.7911 428.3176 430.9029 444.3379 479.7882 491.6347 493.3328 507.6433 511.1244 515.8775 552.7606 588.4901 597.1479 622.6344 637.7263 644.0501 650.5741 658.1576 668.7890 694.8178 700.1964 712.7137 714.3869 736.6281 742.3784 749.4563 755.1814 757.7254 762.6108 814.7191 848.4557 857.2683 868.9588 876.8050 922.2404 946.5406 951.3153 962.6465 992.4183 997.7916 1023.8729 1052.6040 1085.2192 1110.2374 1115.8084 1127.0942 1142.7746 1143.3001 1199.4589 1203.2078 1211.0726 1215.4408 1224.1567 1249.6329 1251.4539 1261.1345 1355.2385 1362.7869 1370.2356 1376.4115 1395.4974 1405.9645 1408.5623 1423.6215 1435.0421 1450.3786 1459.7915 1502.1854 1579.5278 1592.8822 1594.3840 1606.1517 3161.0175 3177.4814 3186.5262 3189.3405 3191.2812 3196.5373 3261.4589
redmass: 12.6006 12.2434 12.4965 11.0909 14.8559 11.6850 13.9555 15.4796 11.2456 12.3778 9.8285 9.0958 14.7312 7.2086 8.5995 6.0709 12.3212 14.1704 11.8004 12.3755 9.0507 8.9628 8.5537 8.8997 9.2332 13.1499 11.2074 11.9414 13.4189 9.9326 4.0592 4.5681 7.6757 8.0795 6.8072 7.6971 6.7715 6.5671 5.3440 9.1511 7.7280 7.0745 9.3989 8.9973 7.8534 8.7465 8.0104 7.6358 9.9080 4.5514 5.3927 6.0187 5.6136 4.7940 3.1952 4.5835 11.8261 3.3018 5.1233 1.4442 1.3845 8.6571 7.8284 10.3930 4.9594 1.5146 1.4819 1.3388 1.3667 6.0702 2.2289 1.6529 3.3605 6.4369 1.8886 1.3362 1.4168 10.7166 9.2856 9.2863 7.4044 3.9255 1.7065 1.4318 4.2510 4.7110 6.8605 9.6657 12.0205 10.8874 10.0469 7.0996 6.2617 8.2439 2.8202 3.0566 7.8127 8.8483 9.2674 7.1353 7.4504 1.0908 1.0898 1.0921 1.0924 1.0961 1.0964 1.0972
irintensity: 0.3832 0.1343 0.1668 1.7518 0.8508 0.4655 0.0509 0.1288 1.8813 1.3953 1.8487 3.7068 3.5241 2.4363 5.3228 1.6136 1.1704 0.6187 1.8661 9.9001 0.1635 2.4177 0.3947 1.0230 0.0740 1.7337 0.0500 1.2843 1.0936 1.5891 1.3148 0.6821 0.9961 1.9510 5.8979 16.3107 6.5376 4.7068 3.0299 3.1292 0.6204 10.9540 11.2423 1.9911 18.6335 6.6919 11.7354 18.1813 10.0353 24.7540 9.9977 14.6939 1.2819 3.5149 29.7493 27.3936 16.1976 18.2968 6.6365 41.9173 28.2247 31.0070 24.3642 82.0250 86.1096 31.9556 29.2315 0.5708 0.7284 33.0217 46.3859 15.1915 8.5712 2.8836 37.2969 48.0007 40.0689 287.7504 284.0033 129.4559 472.4264 196.4083 5.7985 6.8906 206.5800 43.4767 94.6009 59.7276 66.4501 60.6794 23.9223 54.5917 19.1972 72.9751 29.6209 187.9335 149.4802 25.6575 19.4295 74.7255 110.8741 0.5812 0.3382 17.8520 20.6798 5.5564 7.2847 19.9574
temp: 298.150 k
press: 1.00000 atm
elementType: 16 16 8 8 8 8 8 8 8 8 8 7 7 7 7 7 6 6 6 6 6 6 6 6 6 6 6 6 6 6 6 1 1 1 1 1 1 1
symmnumber: 1
zpe: 578707.5 jmol-1
zpe.correction: 0.220418 hartree
zpe.thermalcorrener: 0.247659 hartree
zpe.thermalcorrenthalpy: 0.248603 hartree
zpe.thermalcorrgfe: 0.156594 hartree
zpe.sumelectzpe: -2320.112116 hartree
zpe.sumelectthermal: -2320.084876 hartree
zpe.sumelectthermalent: -2320.083931 hartree
zpe.sumelectthermalfe: -2320.175940 hartree
dipole: -5.8185 -7.6091 -0.7607
dipole: 9.6089
quadrupole: -202.7415 -215.2590 -200.6396
quadrupole: 4.4561 -18.9012 6.1174
quadrupole: 3.4719 -9.0456 5.5737 4.4561 -18.9012 6.1174
hfenergy: -2320.3325341 hartree
pointgroup: C01 [X(C15H7N5O9S2)]
dipole: -3.1753743 1.9924544 -0.4887409 debye
polarizability: 288.9860346|-22.8441426|397.4675877|32.5182518|10.927544|217.1306313 unknown
InChI: InChI=1S/C15H7N5O9S2/c21-17(22)8-1-3-12(10(5-8)19(25)26)29-14-7-30-15(16-14)31-13-4-2-9(18(23)24)6-11(13)20(27)28/h1-7H
charge 0 multiplicity 1
38 atoms
S  -3.460203 1.690512 -1.297688
S  -2.344803 4.088472 0.344896
O  1.41578 2.850322 0.135415
O  -1.342073 -0.97743 1.856205
O  -2.731322 0.788173 1.490154
O  5.017439 1.712272 -1.398652
O  3.914353 3.539121 -0.586025
O  -2.784149 -4.878341 -2.83266
O  -1.909714 -4.97403 -0.723673
O  3.243118 -2.688184 2.77178
O  5.132957 -2.122117 1.621288
N  -0.799825 2.081101 -0.503977
N  -2.177535 -0.316335 1.123819
N  4.129127 2.272514 -0.645416
N  -2.433606 -4.339499 -1.714728
N  3.919878 -1.904059 2.00222
C  1.996269 1.674227 0.618405
C  -3.067963 -0.099477 -1.264923
C  -2.515805 -0.875097 -0.205818
C  3.335785 1.375907 0.23249
C  -2.656003 -2.876874 -1.561587
C  -2.287353 -2.259266 -0.358196
C  3.255277 -0.667163 1.525393
C  3.962825 0.195919 0.671101
C  -3.411958 -0.765822 -2.471379
C  1.311361 0.783298 1.479519
C  -3.229876 -2.149276 -2.626677
C  1.933467 -0.38703 1.938332
C  0.023059 3.003782 0.148099
C  -2.054168 2.487315 -0.491304
C  -0.580898 4.142354 0.649303
H  -1.842396 -2.837299 0.45599
H  4.980062 -0.041594 0.349691
H  -3.808152 -0.176138 -3.303626
H  0.290754 1.008068 1.797761
H  -3.497673 -2.663463 -3.553025
H  1.409421 -1.078397 2.602336
H  -0.116559 4.986733 1.150958
