program: Gaussian 09
title: 000235679
version: EM64L-G09RevD.01
frameworkgroup: C1[X(C9H13NO2S)]
method: RPBEPBE
basis: SDD
operation: Freq
keyword: #p
keyword: freq=noraman
keyword: PBEPBE/SDD
title: #p freq=noraman PBEPBE/SDD
converged: YES YES NO NO
title: Mulliken charges:
elementType: S O O N C C C C C C C C C H H H H H H H H H H H H H
charge: 0.929823 -0.536792 -0.539896 -0.487452 -0.232722 0.505732 -0.593711 0.476818 -0.254692 -0.366145 -0.815822 -0.804672 -0.601924 0.301230 0.245731 0.244907 0.217772 0.271812 0.277148 0.317160 0.228845 0.239531 0.233264 0.239746 0.253511 0.250797
chargesum: 0.00000
title: Mulliken charges with hydrogens summed into heavy atoms:
elementType: S O O N C C C C C C C C C
charge: 0.929823 -0.536792 -0.539896 -0.170292 -0.232722 0.505732 -0.347980 0.476818 0.046537 -0.121238 -0.049090 -0.103032 0.142130
polarizability: 1.76767015e+02 5.99174932e+00 1.35775690e+02 -8.65678403e-01 3.25530496e+00 9.78831912e+01
1716.lowfreq: -17.0576 -9.2298 -5.1846 -0.0013 -0.0010 0.0007 3.6224 42.3151 61.1698
frequency: -16.3337 42.2794 61.1481 90.0203 117.8979 142.7638 160.8781 168.8239 194.6396 205.7115 231.3566 258.4795 284.5127 295.6164 319.1783 395.6058 401.9047 444.1004 452.6523 478.1908 537.2510 554.3086 580.3699 712.6799 718.2648 797.3429 822.7160 838.6654 894.2752 913.5144 929.2856 980.0413 988.4380 994.7669 1000.3075 1024.5614 1049.1968 1057.4331 1092.9751 1106.5938 1148.6409 1171.9764 1244.1924 1283.1528 1325.3760 1370.8798 1392.3803 1400.9326 1406.9656 1413.9877 1448.3855 1453.5719 1456.8648 1470.2631 1478.4996 1484.9248 1488.5716 1582.0837 1607.8581 2970.6901 2981.7037 2988.4254 3061.1912 3065.4255 3072.5053 3091.4314 3095.1420 3100.5491 3127.7421 3135.2014 3157.4181 3351.6134
redmass: 1.0340 3.2777 3.9769 3.2878 1.1165 1.5686 2.1770 4.7796 3.1915 3.1345 5.7754 4.6301 3.4748 5.7571 4.5935 4.8441 6.3326 3.3585 3.4228 5.2113 5.3556 3.2411 5.2032 5.4238 3.3370 12.4495 1.3059 1.2911 1.2916 3.3503 8.8740 1.3220 1.4370 6.8998 3.3029 1.5088 1.5752 1.5594 1.3897 1.4654 1.3911 1.6404 2.4238 1.6339 1.1988 5.2775 2.2202 1.4314 1.2455 1.1337 1.0391 1.3007 1.5833 1.0486 1.1751 1.0993 1.1103 6.2224 6.4971 1.0351 1.0376 1.0367 1.0972 1.0992 1.0967 1.0991 1.1007 1.1006 1.0914 1.0888 1.0962 1.0747
irintensity: 0.5873 2.3909 1.1343 1.0413 1.3972 0.4104 2.0407 2.4197 1.2434 5.3437 9.2713 4.1136 1.5583 3.7533 1.2492 17.0883 35.0596 23.7930 17.8882 88.6734 2.7927 14.4414 30.8858 4.2477 0.1784 77.2868 102.0429 30.8523 1.6504 23.0967 64.1539 0.9274 1.0950 0.1124 2.4964 7.6951 7.7434 19.6181 6.8413 13.7945 2.5742 6.0845 20.7277 1.9080 5.2699 9.4602 5.7722 17.0480 13.0224 8.9110 10.3136 14.9112 8.8453 14.9784 22.1621 35.5513 18.3481 8.9380 16.9811 37.8156 25.7609 14.2629 16.4158 12.9619 2.8834 16.0623 15.0613 15.0941 17.2727 7.3520 11.2902 11.6698
temp: 298.150 k
press: 1.00000 atm
elementType: 16 8 8 7 6 6 6 6 6 6 6 6 6 1 1 1 1 1 1 1 1 1 1 1 1 1
symmnumber: 1
zpe: 533338.9 jmol-1
zpe.correction: 0.203138 hartree
zpe.thermalcorrener: 0.217342 hartree
zpe.thermalcorrenthalpy: 0.218286 hartree
zpe.thermalcorrgfe: 0.162138 hartree
zpe.sumelectzpe: -952.854472 hartree
zpe.sumelectthermal: -952.840268 hartree
zpe.sumelectthermalent: -952.839324 hartree
zpe.sumelectthermalfe: -952.895472 hartree
dipole: -3.4935 0.1697 4.1756
dipole: 5.4469
quadrupole: -74.6079 -84.7857 -90.5423
quadrupole: 2.1848 11.4657 -0.1751
quadrupole: 8.7041 -1.4737 -7.2304 2.1848 11.4657 -0.1751
hfenergy: -953.0576104 hartree
pointgroup: C01 [X(C9H13N1O2S1)]
dipole: -1.4371374 -0.1837958 -1.5789962 debye
dipolederiv: 1.9078418 0.0914735 -0.1922427 0.0664339 1.1594693 0.0068672 -0.0978535 -0.0286571 1.4129813 -0.7184668 -0.0825798 0.0250765 -0.0519263 -0.6735693 -0.1710118 0.0209636 -0.0219156 -0.5658203 -0.7378432 0.0228813 -0.0387947 0.0132937 -0.5658072 0.170741 0.0128573 0.0690434 -0.6327082 -0.4762784 -0.0494164 0.107036 -0.0211671 -0.5438466 -0.0207545 0.0519643 -0.0293249 -0.4676625 -0.0688389 0.0244905 -0.0134902 0.0520107 -0.2159329 0.0096756 -0.0171855 0.0255546 -0.2363352 0.0145133 -0.2944227 -0.025902 0.0806258 0.2638735 0.0177785 0.0024941 -0.0007941 0.0454857 -0.2847369 0.2439102 0.0318614 0.1118047 -0.0630469 0.0286593 0.0197284 0.0348389 -0.1595876 0.5436308 -0.0220863 0.029594 -0.0402773 0.0961623 0.0084976 0.0083509 0.0097174 0.0043574 -0.0918237 0.0783307 0.0261971 -0.2848943 -0.0761533 0.00511 -0.0410377 0.0168856 -0.0827419 -0.2436961 -0.1458259 -0.0156625 -0.1080019 0.0237563 0.020298 -0.0070144 0.0183672 -0.1756382 -0.0894918 0.1892663 0.0338943 0.1224794 -0.0992216 0.015295 0.000348 0.0204915 -0.0231241 -0.2103785 0.0231898 -0.0073616 0.1114829 0.0740383 0.0087679 0.0404514 0.0026698 0.0541006 0.0544365 -0.0085478 0.1582272 0.1591895 0.2325789 -0.2077332 0.0339399 -0.0176124 0.0896856 0.1482061 -0.0638733 -0.0268647 -0.0236489 0.0727533 -0.0087929 -0.013491 -0.0118365 0.1474207 -0.0053728 -0.0738357 -0.0184125 -0.0853512 -0.0468605 -0.0321939 -0.0284056 -0.0347251 0.1402274 -0.0088155 0.0861999 0.003699 0.0889689 -0.0378917 -0.0223992 -0.0047761 -0.0182827 0.1531346 -0.0280901 -0.1817634 -0.0312311 -0.0662912 -0.0423366 -0.0270292 -0.0208753 -0.0465194 0.1101906 0.0595767 0.0403668 0.0788372 0.027746 0.0820799 0.0227016 0.0839802 -0.0123548 0.0165961 0.104853 0.0567307 -0.0746209 0.0401965 0.0845646 -0.0233987 -0.0558471 0.0329198 0.010578 0.0548427 0.0491483 -0.0347941 -0.0084238 0.2300238 0.0655041 0.0385454 0.0768323 0.0378612 0.0428438 -0.0159261 -0.0114995 -0.1292924 -0.0936683 -0.0619575 -0.0438175 -0.047832 0.093386 -0.0231641 0.0133125 0.0506216 0.0134053 0.0944486 -0.0655884 0.1047252 -0.052492 -0.0581921 0.011773 0.0148995 -0.0306881 0.0495333 -0.0010869 0.1177637 -0.095634 0.0971208 0.0069013 0.0930451 0.0197782 0.0746185 0.0056326 0.0632861 0.0099898 0.1128979 -0.0278761 -0.0910936 0.0247421 -0.0860687 -0.025742 -0.1518773 -0.0627721 0.081295 -0.0656062 -0.0516675 0.0647436 -0.0733081 0.0703679 -0.0723563 0.0283487 0.0451592 0.0519151 -0.039703 -0.0025511 0.1052536 unknown
polarizability: 177.1007529|-4.3220762|135.5848828|-2.3526515|1.96258|97.7402611 unknown
InChI: InChI=1S/C9H13NO2S/c1-7-4-5-9(8(2)6-7)13(11,12)10-3/h4-6,10H,1-3H3
charge 0 multiplicity 1
26 atoms
S  1.87294 0.202134 0.442949
O  2.234545 1.771665 0.725855
O  2.430564 -0.960823 1.438887
N  2.489122 -0.322473 -1.261519
C  -0.00167 0.108138 0.217019
C  -0.644801 -1.131179 -0.009148
C  -2.058679 -1.068287 -0.13089
C  -2.787814 0.143096 -0.028205
C  -0.673536 1.336996 0.332634
C  -2.07645 1.349208 0.205068
C  0.090034 -2.45044 -0.126129
C  -4.300569 0.154263 -0.151309
C  2.604036 0.826706 -2.198981
H  -0.099247 2.249694 0.523715
H  -2.601081 -2.004492 -0.3105
H  -2.619537 2.297331 0.290329
H  -0.615176 -3.273108 -0.327786
H  0.833866 -2.406625 -0.942567
H  0.650571 -2.674692 0.798514
H  3.407166 -0.760733 -1.045301
H  -4.695185 -0.835697 -0.435383
H  -4.772955 0.442147 0.806827
H  -4.635473 0.885195 -0.910019
H  3.036958 0.435075 -3.13722
H  3.23157 1.65954 -1.826044
H  1.596504 1.212761 -2.426496
