program: Gaussian 09
title: 000235673
version: EM64L-G09RevD.01
frameworkgroup: C1[X(C22H31FO3)]
method: RPBEPBE
basis: SDD
operation: Freq
keyword: #p
keyword: freq=noraman
keyword: PBEPBE/SDD
title: #p freq=noraman PBEPBE/SDD
converged: YES YES NO NO
title: Mulliken charges:
elementType: F O O O C C C C C C C C C C C C C C C C C C C C C C H H H H H H H H H H H H H H H H H H H H H H H H H H H H H H H
charge: -0.234357 -0.440809 -0.215196 -0.236956 0.367417 -0.080658 -0.272057 0.287232 -0.240904 -0.633780 -0.600500 0.155206 -0.245888 -0.073878 -0.448183 -0.868193 0.596151 -0.653011 -0.511800 -0.811443 0.159827 -0.773951 -0.570779 -0.589642 0.181049 -0.803084 0.262017 0.241424 0.227491 0.234281 0.242853 0.236051 0.219663 0.264450 0.272423 0.224121 0.239588 0.279064 0.226428 0.209939 0.220847 0.243004 0.245061 0.244234 0.209416 0.281973 0.232012 0.211562 0.222496 0.224384 0.362263 0.248170 0.230397 0.252545 0.245070 0.248631 0.256330
chargesum: 0.00000
title: Mulliken charges with hydrogens summed into heavy atoms:
elementType: F O O O C C C C C C C C C C C C C C C C C C C C C C
charge: -0.234357 -0.078546 -0.215196 -0.236956 0.367417 0.181359 -0.030633 0.287232 -0.013413 -0.156646 -0.144785 0.155206 0.018562 0.198545 0.015526 -0.152762 0.596151 -0.189159 -0.022505 -0.088043 0.159827 -0.115509 -0.092212 -0.337097 0.181049 -0.053053
polarizability: 3.07362436e+02 -1.60721654e+00 2.17047345e+02 -1.40264060e+01 3.61837852e+00 1.89039322e+02
1716.lowfreq: -7.3959 -0.0008 -0.0005 0.0009 7.2613 18.0170 32.4666 45.4202 61.2376
frequency: 32.2943 45.3804 61.1810 71.7427 78.3534 93.7118 117.2319 128.8432 136.7331 150.9513 170.9388 182.2981 190.0310 199.3992 206.5387 219.8694 224.1885 233.9720 251.8160 256.3012 265.2043 271.8018 284.8194 292.7870 305.0563 322.0529 340.5267 361.7100 366.3435 378.6037 388.4418 400.8551 421.9735 451.6902 462.9494 469.1798 504.8414 509.4500 519.9363 525.6128 535.6011 572.4690 583.8503 588.8260 618.4245 639.9749 659.2643 682.6309 729.7886 758.7575 774.6973 802.7940 827.8449 837.1834 848.4155 856.0380 862.7598 884.5247 901.8626 908.1857 925.4817 932.0925 941.2140 943.3473 950.4928 956.8680 966.0621 971.0744 993.7744 1017.1291 1020.6575 1033.1454 1036.9415 1046.2851 1070.5563 1078.0579 1086.7624 1092.7395 1103.4159 1113.8401 1120.1817 1132.1026 1142.4444 1154.8893 1160.0858 1171.1720 1175.3708 1182.6747 1195.1612 1204.2804 1212.8989 1219.0056 1228.7778 1238.2703 1241.9584 1257.9714 1265.1596 1280.8704 1288.4321 1291.9104 1302.4798 1314.7884 1324.1424 1328.1700 1328.9454 1340.8787 1343.8282 1344.6201 1349.5457 1355.4532 1364.8077 1368.9971 1370.0847 1375.5743 1386.3618 1387.4287 1402.9129 1441.7748 1442.9592 1449.2615 1455.1133 1455.8010 1467.5883 1470.9476 1474.7832 1476.8446 1477.1627 1479.5296 1489.7679 1499.4851 1501.3229 1585.1463 1620.0021 1631.1793 2952.0617 2954.1877 2966.7316 2971.9978 2975.0453 2978.4337 2978.6082 2983.0802 2984.0595 2988.1640 2996.4431 2999.9330 3000.3273 3011.0645 3041.5385 3041.7924 3051.2304 3054.3989 3058.8109 3060.1660 3061.1753 3062.4418 3063.1141 3066.4174 3069.4493 3079.7242 3086.2658 3120.1707 3120.6892 3122.1463 3584.6321
redmass: 6.6920 3.8002 5.3332 4.1407 3.0192 4.2112 1.7424 1.6115 3.1487 4.0065 1.3757 2.4164 4.4827 3.5232 3.0053 1.3280 2.0863 2.3199 2.0925 2.3828 2.3399 3.1927 3.1657 1.3856 2.8247 3.0974 2.7194 2.7729 3.2330 3.1922 2.9928 3.2135 3.2911 2.9820 3.1529 3.1582 3.6102 2.8723 3.6786 2.5903 3.6982 3.1433 3.6738 3.5029 3.6696 3.4922 3.2035 3.8120 3.0974 3.6225 2.1815 2.4363 2.2109 3.3152 2.6888 2.5931 3.1938 1.4612 2.3933 2.0101 1.9119 1.8191 2.1107 1.8114 2.0057 1.9261 2.1979 1.8154 2.4526 1.8476 2.0532 2.0101 1.8327 1.9766 2.2743 2.3383 2.1809 2.4303 2.6017 2.5801 1.7117 2.2972 2.3025 2.1372 2.2898 1.6999 1.6925 2.0339 1.9145 1.5643 1.8934 1.7106 1.6109 1.3947 1.5354 1.4617 1.4746 1.9901 1.5358 1.4853 1.4508 1.6385 1.4608 1.3972 1.4541 1.9691 1.4199 1.4534 1.4717 1.4057 1.2819 1.2172 1.3371 1.3578 1.2133 1.2080 1.1964 1.0785 1.0756 1.0692 1.0738 1.0840 1.0841 1.0534 1.0714 1.0468 1.0630 1.0758 1.0626 1.0559 1.0547 9.8995 7.0600 7.9161 1.0664 1.0808 1.0367 1.0563 1.0545 1.0655 1.0476 1.0707 1.0677 1.0658 1.0378 1.0600 1.0596 1.0836 1.0971 1.0963 1.1012 1.0992 1.0956 1.0942 1.0884 1.1019 1.0990 1.1005 1.0989 1.0982 1.0947 1.0913 1.1003 1.0986 1.0659
irintensity: 2.6270 2.1133 1.6381 4.3325 0.3671 1.0872 0.8834 0.1689 21.1685 0.4107 30.9129 5.4946 0.6529 21.0511 0.3784 13.8719 10.2254 0.1493 6.4570 10.3245 2.8555 1.4020 5.2534 5.7735 0.1629 3.2048 1.5851 0.5438 2.5359 0.7396 3.1818 0.6863 6.1183 3.8676 1.7186 2.3427 4.4447 6.2790 1.8540 2.1511 2.3862 2.3071 7.9521 7.3752 4.8107 0.5406 4.2708 5.7284 1.4849 3.8206 6.0911 2.1570 2.6176 11.0662 11.3712 7.4570 15.7504 22.3707 1.0402 12.1968 2.2043 1.1324 4.1597 5.5199 22.3388 9.2914 17.2757 18.7697 24.9728 9.4379 3.4139 3.9609 5.2508 17.1764 3.9700 13.6827 1.2286 7.2945 6.6420 4.7814 18.0175 5.1699 9.2535 18.8008 25.4770 38.8720 13.0604 26.7305 14.2139 3.1943 7.6642 11.4043 16.0838 21.5226 18.4705 34.6123 17.2802 30.0485 17.6209 10.3119 5.3122 3.5298 6.3656 16.2578 22.9155 8.2771 6.1265 2.9952 10.9754 2.3906 17.1171 37.6890 33.3960 4.4063 26.4958 4.9628 46.6379 20.9890 16.0325 10.6311 14.2817 15.2683 6.7109 10.1362 8.3630 9.7293 15.2477 1.3787 3.9108 4.5488 8.8854 187.7812 104.1352 163.2482 17.4764 0.7364 29.1629 29.4983 4.7529 14.7404 5.5088 23.9907 20.9508 22.0166 37.7431 30.5248 18.6025 13.2163 35.9246 5.6487 24.5417 41.1751 7.2983 12.9007 14.4840 23.1548 51.4011 20.4401 36.1644 37.6827 13.7653 10.1919 16.0082 3.3361 22.6587
temp: 298.150 k
press: 1.00000 atm
elementType: 9 8 8 8 6 6 6 6 6 6 6 6 6 6 6 6 6 6 6 6 6 6 6 6 6 6 1 1 1 1 1 1 1 1 1 1 1 1 1 1 1 1 1 1 1 1 1 1 1 1 1 1 1 1 1 1 1
symmnumber: 1
zpe: 1274651.3 jmol-1
zpe.correction: 0.485489 hartree
zpe.thermalcorrener: 0.511182 hartree
zpe.thermalcorrenthalpy: 0.512127 hartree
zpe.thermalcorrgfe: 0.432598 hartree
zpe.sumelectzpe: -1180.449359 hartree
zpe.sumelectthermal: -1180.423666 hartree
zpe.sumelectthermalent: -1180.422722 hartree
zpe.sumelectthermalfe: -1180.502250 hartree
dipole: -4.8682 0.5988 1.2130
dipole: 5.0527
quadrupole: -210.7209 -151.1339 -156.4651
quadrupole: -1.9617 24.4741 5.6546
quadrupole: -37.9476 21.6395 16.3082 -1.9617 24.4741 5.6546
hfenergy: -1180.9348481 hartree
pointgroup: C01 [X(C22H31F1O3)]
dipole: 1.9190465 -0.2461462 0.4564451 debye
polarizability: 307.6831069|-2.3734597|216.9003798|12.3865779|-4.4103726|188.8656171 unknown
InChI: InChI=1S/C22H31FO3/c1-12-9-17-16-6-5-14-10-15(25)7-8-21(14,4)22(16,23)18(26)11-20(17,3)19(12)13(2)24/h10,12,16-19,26H,5-9,11H2,1-4H3
charge 0 multiplicity 1
57 atoms
F  -1.009425 -0.11432 -1.528805
O  -0.180375 2.542979 0.924949
O  5.393151 0.817532 0.693186
O  -6.343906 -0.084486 -1.067003
C  2.143102 0.399898 0.088682
C  1.339474 -0.933967 -0.022392
C  -0.080677 -0.855097 0.57533
C  -0.873889 0.308951 -0.084836
C  3.502919 -0.079937 -0.566104
C  1.375431 1.471595 -0.721939
C  2.318365 -2.007533 0.506247
C  -2.359057 0.452649 0.431133
C  -0.092571 1.662058 -0.255999
C  3.732555 -1.515695 0.028125
C  -0.836873 -2.192728 0.376522
C  2.392255 0.834284 1.562104
C  -3.053486 -0.916444 0.297531
C  -2.307611 -2.119226 0.845934
C  -3.090531 1.530864 -0.427102
C  -2.415819 0.853001 1.944424
C  4.678599 0.874644 -0.346687
C  4.394974 -2.463752 -0.993973
C  -4.626182 1.483273 -0.293904
C  -4.324783 -1.047239 -0.196716
C  -5.183585 0.090495 -0.581981
C  4.952963 1.902742 -1.436322
H  1.202542 -1.116484 -1.110154
H  -0.014904 -0.649358 1.663266
H  3.31821 -0.157126 -1.65801
H  1.355134 1.163444 -1.785218
H  1.86438 2.464369 -0.672724
H  2.273851 -2.073555 1.610651
H  2.090108 -3.012835 0.10947
H  -0.628911 2.223536 -1.038564
H  4.410773 -1.412308 0.89597
H  -0.312204 -2.993717 0.929511
H  -0.807677 -2.455178 -0.697137
H  3.157585 0.207535 2.048846
H  2.774842 1.871745 1.61135
H  1.478306 0.760037 2.181887
H  -2.32123 -2.059996 1.955824
H  -2.843057 -3.048018 0.578244
H  -2.827895 1.36857 -1.488906
H  -2.725146 2.532699 -0.13649
H  -1.883661 0.134195 2.591788
H  -1.969835 1.848559 2.086048
H  -3.468442 0.873343 2.277981
H  3.743865 -2.61724 -1.876365
H  5.362485 -2.061716 -1.349298
H  4.591813 -3.454367 -0.544427
H  0.594082 2.3791 1.517187
H  -5.109049 2.204626 -0.976453
H  -4.940528 1.76317 0.732693
H  -4.786841 -2.039652 -0.282135
H  5.347916 1.389819 -2.335661
H  4.02291 2.413012 -1.748027
H  5.693762 2.641549 -1.093053
