program: Gaussian 09
title: 000235670
version: EM64L-G09RevD.01
frameworkgroup: C1[X(C17H27NO2)]
method: RPBEPBE
basis: SDD
operation: Freq
keyword: #p
keyword: freq=noraman
keyword: PBEPBE/SDD
title: #p freq=noraman PBEPBE/SDD
converged: YES YES NO NO
title: Mulliken charges:
elementType: O O N C C C C C C C C C C C C C C C C C H H H H H H H H H H H H H H H H H H H H H H H H H H H
charge: -0.338199 -0.269106 -0.307138 0.343903 -0.387809 -0.423697 -0.368377 -0.345068 -0.337603 -0.735701 -0.727453 -0.357778 -0.695198 0.231298 0.208389 -0.345406 -0.335587 -0.220213 -0.219443 -0.223292 0.195558 0.201212 0.198329 0.188077 0.201706 0.185914 0.179815 0.216503 0.261103 0.183743 0.179305 0.220521 0.268344 0.213483 0.250435 0.259939 0.205682 0.193615 0.197130 0.208380 0.214993 0.209282 0.270248 0.255708 0.232871 0.229692 0.231893
chargesum: 0.00000
title: Mulliken charges with hydrogens summed into heavy atoms:
elementType: O O N C C C C C C C C C C C C C C C C C
charge: -0.338199 -0.269106 -0.046035 0.343903 0.008961 -0.037291 0.019244 0.051250 0.025445 -0.033353 -0.011398 0.032968 -0.062543 0.231298 0.208389 -0.075158 -0.079879 0.012658 0.010248 0.008601
polarizability: 2.05849900e+02 -2.14674321e+01 2.17892450e+02 1.67717703e+01 1.49075789e+01 1.71577874e+02
1716.lowfreq: -10.7044 -7.5210 -1.1203 -0.0011 -0.0007 -0.0007 9.2338 20.0544 34.4018
frequency: 6.4727 19.9416 34.3926 37.4494 46.2815 54.9389 80.5968 100.2892 110.2655 116.1483 128.1046 151.8095 163.0994 168.9847 192.9171 212.4180 226.2347 230.4220 240.2471 245.4937 293.6238 311.5778 316.9914 355.7634 393.3456 404.3540 406.2708 436.1486 453.5367 471.5493 511.6187 540.7454 614.6339 659.2682 679.9283 700.1561 703.9853 724.8305 728.2075 752.8899 795.4410 810.8512 822.6058 833.9877 864.3362 880.4067 887.9485 906.5723 925.4575 933.5957 952.4487 966.9393 990.4588 994.5989 1005.2428 1007.8826 1017.5645 1020.2615 1028.7090 1037.9066 1058.4732 1077.1276 1083.7764 1085.6385 1113.4366 1120.8766 1157.8582 1173.0086 1174.6376 1181.1590 1193.1820 1203.8035 1220.4111 1234.8459 1251.2579 1265.1407 1267.9717 1278.5651 1284.4377 1294.1185 1309.4421 1311.3135 1333.5210 1349.8310 1358.3938 1371.0864 1380.3267 1385.6723 1389.4002 1393.5503 1437.4100 1439.6947 1454.9506 1463.1735 1463.4374 1465.2788 1470.3757 1471.6188 1474.6581 1476.5052 1476.5808 1481.7523 1488.6386 1488.9370 1491.6840 1582.4323 1610.0981 1613.4673 2841.8869 2860.7069 2946.3853 2950.9952 2962.8494 2968.9410 2970.1889 2984.6664 2989.1377 2990.1718 2996.8622 3007.9432 3008.6337 3020.1409 3046.2738 3067.1480 3069.3486 3081.0957 3091.4659 3118.9846 3125.5411 3129.0562 3141.4823 3154.4859 3166.4049 3177.2210 3435.6229
redmass: 4.2894 3.9006 3.1250 2.5052 2.5296 4.1670 2.6253 3.6427 2.9099 2.2728 2.6787 1.7465 2.7582 3.7088 1.6021 2.4029 1.2707 1.1389 2.2727 3.7474 3.8370 2.7815 2.9085 3.0653 3.2803 2.8513 3.4339 3.3381 3.5266 3.7313 3.2760 2.6138 6.4364 5.9579 4.9717 1.4238 1.4477 1.0822 6.4014 1.1407 2.2316 6.2629 1.2646 3.1848 1.2446 2.2020 1.6312 1.7494 1.4949 1.3956 1.4234 1.4185 5.8928 1.4007 1.3975 1.3293 1.7704 2.5301 2.2036 2.4097 2.7996 2.2965 2.3160 1.7933 1.6262 2.1102 3.8412 1.0727 1.5520 1.4170 1.8812 1.7108 1.5024 1.9721 1.5908 2.1212 1.3276 1.2272 1.2750 1.2676 1.3349 1.3254 1.3418 1.5771 1.6453 1.2425 1.3427 1.2188 9.6708 1.2868 2.2289 1.1856 1.0593 1.0743 1.0734 1.0753 1.0778 1.0811 1.1836 1.0629 1.8106 1.0740 1.0868 1.0746 1.0726 7.0495 6.3631 8.4674 1.0714 1.0706 1.0593 1.0635 1.0620 1.0599 1.0386 1.0859 1.0958 1.0373 1.0398 1.0923 1.0878 1.1026 1.1021 1.1008 1.0992 1.0987 1.0956 1.0993 1.1013 1.0854 1.0891 1.0938 1.0974 1.0977 1.0736
irintensity: 0.0738 0.3223 0.0428 0.0823 0.0815 1.9913 0.2387 1.3072 1.0170 0.6525 1.0213 0.7116 1.4786 1.1990 0.4083 3.2138 0.5243 0.1480 1.7599 0.8030 4.3612 0.1097 6.9397 0.8196 0.9539 0.1126 2.3969 3.3185 1.4495 4.8079 1.7846 2.1836 0.6756 1.6600 12.1662 9.9637 159.1832 17.3577 17.1514 4.1575 19.4997 6.7677 3.7543 17.3757 0.2349 2.2983 3.9478 2.6188 3.1793 1.3544 3.5971 7.5968 1.5596 0.1348 4.3143 0.4500 22.3949 67.9018 0.8126 0.7154 270.3396 0.5807 7.0112 51.0312 78.0186 26.8927 46.4600 4.3996 80.9234 5.6814 52.8476 27.6140 10.5601 164.3377 64.3266 48.3555 6.4741 8.3862 4.8745 2.6896 0.2269 1.4346 2.4074 1.1503 0.9634 36.1430 27.8698 16.9865 1.6077 29.0603 10.4353 57.8232 0.9423 0.8701 4.2600 5.1930 6.8445 2.7737 41.9608 11.1988 2.6962 1.2250 21.1956 5.1295 17.1460 53.8792 14.4917 111.5403 92.5277 144.9796 4.6830 24.0259 1.3011 108.8022 27.8025 43.5047 12.5481 21.4936 13.2695 9.7858 67.3290 2.1638 92.2826 103.5535 53.1985 28.5589 29.6780 6.2433 8.8090 0.1675 11.1095 15.8106 25.0217 9.1984 1.1147
temp: 298.150 k
press: 1.00000 atm
elementType: 8 8 7 6 6 6 6 6 6 6 6 6 6 6 6 6 6 6 6 6 1 1 1 1 1 1 1 1 1 1 1 1 1 1 1 1 1 1 1 1 1 1 1 1 1 1 1
symmnumber: 1
zpe: 1065667.8 jmol-1
zpe.correction: 0.405891 hartree
zpe.thermalcorrener: 0.428745 hartree
zpe.thermalcorrenthalpy: 0.429689 hartree
zpe.thermalcorrgfe: 0.349820 hartree
zpe.sumelectzpe: -867.650744 hartree
zpe.sumelectthermal: -867.627891 hartree
zpe.sumelectthermalent: -867.626947 hartree
zpe.sumelectthermalfe: -867.706816 hartree
dipole: 0.7511 0.6655 2.3111
dipole: 2.5195
quadrupole: -124.9051 -111.5295 -123.6185
quadrupole: -10.6193 -1.3607 -0.4294
quadrupole: -4.8874 8.4882 -3.6008 -10.6193 -1.3607 -0.4294
hfenergy: -868.0566355 hartree
pointgroup: C01 [X(C17H27N1O2)]
dipole: -0.2727498 0.2251232 -0.926028 debye
polarizability: 207.7264689|23.0007844|213.8268907|15.0983747|-17.858939|173.7668648 unknown
InChI: InChI=1S/C17H27NO2/c1-4-5-6-10-13-18-14-17(2,3)20-16(19)15-11-8-7-9-12-15/h7-9,11-12,18H,4-6,10,13-14H2,1-3H3
charge 0 multiplicity 1
47 atoms
O  1.277547 -1.109985 0.009117
O  2.847728 -1.228557 1.749197
N  -1.423452 -1.325173 -0.708314
C  0.557362 -2.409251 0.38191
C  -0.524601 -2.489938 -0.722151
C  -3.412702 -0.121121 -1.618654
C  -2.530725 -1.385208 -1.686488
C  -4.14816 0.060202 -0.272226
C  -4.997236 1.349781 -0.218798
C  1.543824 -3.584954 0.261972
C  -0.058072 -2.274089 1.785613
C  -5.740396 1.53828 1.123658
C  -6.593925 2.824546 1.164767
C  2.364164 -0.645711 0.744803
C  2.892206 0.64242 0.190627
C  3.965235 1.268512 0.876757
C  2.361082 1.240765 -0.981424
C  4.498982 2.482654 0.398023
C  2.898719 2.455082 -1.458393
C  3.966541 3.078806 -0.770249
H  -0.005433 -2.634628 -1.703397
H  -1.12656 -3.401529 -0.536373
H  -4.153069 -0.166321 -2.443188
H  -2.78243 0.772549 -1.818731
H  -3.147984 -2.276958 -1.452584
H  -2.16413 -1.518461 -2.737278
H  -4.803089 -0.819113 -0.096468
H  -3.404091 0.059732 0.547347
H  -0.883405 -0.452242 -0.793553
H  -4.342786 2.229034 -0.398644
H  -5.73801 1.340957 -1.046596
H  2.034483 -3.584075 -0.727872
H  2.316063 -3.530544 1.044423
H  0.993678 -4.537517 0.373727
H  -0.778483 -1.440276 1.802366
H  0.722386 -2.122818 2.5470
H  -0.609484 -3.20214 2.025526
H  -6.38825 0.656775 1.307528
H  -5.0002 1.556407 1.94932
H  -7.361342 2.815886 0.367565
H  -7.114412 2.936358 2.133865
H  -5.964665 3.722133 1.01336
H  4.360304 0.78627 1.776975
H  1.540281 0.747178 -1.50901
H  5.326101 2.963701 0.93125
H  2.489092 2.914964 -2.36443
H  4.381819 4.022217 -1.142373
