program: Gaussian 09
title: 000235668
version: EM64L-G09RevD.01
frameworkgroup: C1[X(C16H25NO2)]
method: RPBEPBE
basis: SDD
operation: Freq
keyword: #p
keyword: freq=noraman
keyword: PBEPBE/SDD
title: #p freq=noraman PBEPBE/SDD
converged: YES YES NO NO
title: Mulliken charges:
elementType: O O N C C C C C C C C C C C C C C C C H H H H H H H H H H H H H H H H H H H H H H H H H
charge: -0.299179 -0.259548 -0.320838 -0.055331 -0.395219 -0.375545 -0.017773 0.008871 -0.742086 -0.737740 -0.712546 -0.709903 0.187252 0.211992 -0.341920 -0.341240 -0.221200 -0.218688 -0.223033 0.231433 0.176171 0.211778 0.208658 0.192617 0.227224 0.189683 0.242804 0.221497 0.230968 0.233682 0.221659 0.229708 0.243272 0.220495 0.204703 0.210541 0.212035 0.205417 0.214126 0.269911 0.269404 0.232981 0.230881 0.232021
chargesum: 0.00000
title: Mulliken charges with hydrogens summed into heavy atoms:
elementType: O O N C C C C C C C C C C C C C C C C
charge: -0.299179 -0.259548 -0.078033 0.176102 -0.007270 0.025731 0.171910 0.236096 -0.055939 -0.043100 -0.076807 -0.078324 0.187252 0.211992 -0.072009 -0.071836 0.011782 0.012193 0.008988
polarizability: 2.55386552e+02 1.37185002e+01 1.70894076e+02 -2.07832103e+01 1.41040858e+01 1.43821964e+02
1716.lowfreq: -8.0581 -0.0011 -0.0009 0.0006 2.4851 9.0894 17.8372 22.2516 28.1052
frequency: 17.2392 22.1788 27.9008 41.9525 66.0457 70.7992 81.9073 113.1895 115.0283 129.7733 157.9854 172.9854 192.6278 211.3363 231.3667 239.1328 250.6014 265.9940 274.2069 280.9662 326.3269 369.0445 374.4521 397.0494 403.8058 422.8001 442.0099 452.6168 497.6456 554.8493 577.5416 614.2542 662.9986 678.7978 701.7356 719.4916 781.8733 793.0007 794.9820 802.3271 821.2228 855.4335 865.0371 906.4421 915.5097 940.9418 953.0073 954.5516 982.7420 990.3598 995.9023 1003.3035 1008.1146 1019.3676 1019.4162 1038.0058 1053.5305 1068.2590 1080.0076 1087.6579 1120.6323 1140.1877 1162.0808 1163.2826 1173.3962 1178.1870 1180.8026 1197.1889 1215.3785 1243.0852 1268.3272 1279.6153 1299.4055 1313.2911 1321.5245 1325.1192 1330.0757 1348.7232 1364.3173 1367.8524 1377.7496 1384.3022 1387.0341 1389.7001 1394.6582 1437.7400 1460.2258 1463.8612 1469.4504 1469.5742 1474.0519 1476.4971 1478.0251 1479.2361 1482.8528 1489.1767 1492.1407 1495.8227 1582.7306 1610.7852 1615.7585 2869.9684 2872.9409 2943.5439 2958.9743 2966.0935 2970.9736 2989.3417 2997.1614 3003.0358 3005.5740 3028.7592 3058.1975 3065.5097 3068.5984 3074.3520 3085.0203 3092.7004 3098.7884 3101.4839 3129.3405 3142.0446 3154.6448 3166.7432 3178.9699 3392.0067
redmass: 4.2683 4.9689 2.5676 3.6349 3.6551 3.5030 4.9561 2.7718 2.2948 2.8253 4.7374 3.1185 1.4215 1.0843 1.7949 2.2589 1.2258 2.0970 2.4100 1.7751 3.4985 3.7866 2.5793 3.5487 2.8293 2.1294 3.7314 3.8589 3.0288 3.5563 2.5124 6.4390 6.4647 5.0452 1.6061 1.4422 1.2855 4.7285 2.1815 2.8418 2.3119 3.2596 1.2443 2.0053 1.1801 1.6993 1.3496 1.4202 1.5530 6.1108 1.3849 1.8660 1.3269 2.8543 1.5139 2.4094 2.9231 2.4342 1.7989 1.8360 1.6892 2.0962 2.0317 3.2460 1.0582 1.7915 1.1538 2.1082 1.4094 3.3270 1.1944 1.1698 1.4209 1.3234 1.3358 1.4583 1.4186 1.3646 1.3121 1.4367 1.2242 1.2348 1.3382 9.7738 1.2183 2.2430 1.0715 1.0521 1.0462 1.0496 1.0746 1.5770 1.5728 1.0655 1.0549 1.0517 1.0609 1.0859 7.1098 6.5172 8.9859 1.0794 1.0724 1.0675 1.0783 1.0355 1.0364 1.0366 1.0364 1.0837 1.0855 1.0990 1.0994 1.0991 1.0994 1.0986 1.0996 1.1000 1.1003 1.0994 1.0854 1.0891 1.0939 1.0980 1.0974 1.0733
irintensity: 0.2561 0.7409 0.0410 0.2170 0.9519 1.1611 0.5424 0.6834 2.6195 2.6168 0.0434 0.3375 1.3665 0.0247 0.8239 2.1549 0.0492 0.8377 6.5446 0.6340 2.3226 6.6430 1.9873 0.8357 0.0141 2.8521 0.2063 3.3037 8.4423 12.7829 1.5530 0.6912 5.9055 16.7669 87.4924 60.4686 3.6608 5.7689 23.4273 1.2628 0.6173 10.3563 0.0446 6.7554 4.2569 6.5693 0.0711 3.9687 1.2513 3.4317 0.0482 21.0343 0.3847 103.2519 19.7187 4.7646 264.1315 2.3740 57.8434 6.0674 11.5510 5.0229 1.3051 132.3534 0.2251 4.4045 32.8704 5.7779 5.2155 327.2596 9.3553 4.1216 7.9259 1.5484 16.3004 5.1010 3.5482 24.5429 11.7139 1.0370 24.9629 38.0596 16.6665 2.3702 13.5776 15.2151 0.8533 6.3342 5.0516 9.9549 4.6635 12.2517 15.6120 16.3444 8.3854 29.1487 0.9437 2.5151 51.8507 16.2576 124.2869 44.7035 112.8185 7.6214 35.2176 44.2397 31.8612 13.2680 17.4559 11.3043 22.1776 51.3609 7.7304 81.1786 59.7671 64.2457 39.2906 28.3137 23.6886 16.2924 0.2236 11.5748 17.0228 22.8750 8.4230 2.3113
temp: 298.150 k
press: 1.00000 atm
elementType: 8 8 7 6 6 6 6 6 6 6 6 6 6 6 6 6 6 6 6 1 1 1 1 1 1 1 1 1 1 1 1 1 1 1 1 1 1 1 1 1 1 1 1 1
symmnumber: 1
zpe: 994146.1 jmol-1
zpe.correction: 0.378650 hartree
zpe.thermalcorrener: 0.399959 hartree
zpe.thermalcorrenthalpy: 0.400903 hartree
zpe.thermalcorrgfe: 0.325896 hartree
zpe.sumelectzpe: -828.426455 hartree
zpe.sumelectthermal: -828.405146 hartree
zpe.sumelectthermalent: -828.404202 hartree
zpe.sumelectthermalfe: -828.479209 hartree
dipole: -0.4373 0.4135 1.3216
dipole: 1.4522
quadrupole: -98.4227 -115.6393 -117.4567
quadrupole: 0.4066 -4.5037 0.6263
quadrupole: 12.0835 -5.1331 -6.9505 0.4066 -4.5037 0.6263
hfenergy: -828.8051054 hartree
pointgroup: C01 [X(C16H25N1O2)]
dipole: -0.1769363 0.0719776 -0.5384452 debye
polarizability: 255.6571522|-20.9305567|155.2184036|12.1636367|19.6379258|159.2270363 unknown
InChI: InChI=1S/C16H25NO2/c1-12(2)10-11-17-13(3)14(4)19-16(18)15-8-6-5-7-9-15/h5-9,12-14,17H,10-11H2,1-4H3
charge 0 multiplicity 1
44 atoms
O  -1.434091 -0.972022 -0.174557
O  -1.391922 0.374458 1.735699
N  2.306114 -0.674365 -0.03185
C  0.943028 -0.367673 -0.542798
C  4.696601 -0.081822 0.270642
C  3.388256 0.238001 -0.480207
C  5.935104 0.716231 -0.217199
C  -0.022338 -1.406126 0.098515
C  0.897568 -0.388015 -2.083114
C  0.103624 -2.832419 -0.431605
C  5.787552 2.239216 0.021595
C  7.216639 0.184531 0.468297
C  -2.001234 -0.06519 0.726355
C  -3.400392 0.295721 0.350253
C  -4.102115 1.204414 1.184634
C  -4.03173 -0.238563 -0.80312
C  -5.42512 1.575074 0.868683
C  -5.355895 0.135272 -1.115194
C  -6.054389 1.041333 -0.281726
H  0.597153 0.639821 -0.20072
H  4.555821 0.107872 1.35763
H  4.892421 -1.166982 0.159959
H  3.551295 0.089894 -1.564815
H  3.114443 1.312183 -0.334508
H  0.11674 -1.372804 1.197771
H  6.036727 0.547193 -1.311101
H  2.292415 -0.711672 1.000122
H  1.4246 0.4834 -2.509289
H  1.371167 -1.304519 -2.476874
H  -0.150777 -0.347906 -2.427951
H  -0.518333 -3.526009 0.159643
H  -0.214029 -2.895644 -1.486222
H  1.160526 -3.143411 -0.363189
H  4.933625 2.666577 -0.5341
H  5.631477 2.44933 1.097864
H  6.69951 2.777231 -0.298114
H  8.114635 0.719381 0.106799
H  7.159944 0.32487 1.565351
H  7.359851 -0.894627 0.272721
H  -3.593408 1.602671 2.068791
H  -3.480034 -0.93867 -1.436437
H  -5.965502 2.275999 1.514017
H  -5.844068 -0.2773 -2.004832
H  -7.082855 1.329662 -0.526918
