program: Gaussian 09
title: 000235661
version: EM64L-G09RevD.01
frameworkgroup: C1[X(C17H23N3O)]
method: RPBEPBE
basis: SDD
operation: Freq
keyword: #p
keyword: freq=noraman
keyword: PBEPBE/SDD
title: #p freq=noraman PBEPBE/SDD
converged: YES YES NO NO
title: Mulliken charges:
elementType: O N N N C C C C C C C C C C C C C C C C C H H H H H H H H H H H H H H H H H H H H H H H
charge: -0.294913 -0.091445 -0.408527 -0.496048 -0.354405 -0.324537 -0.326126 -0.396026 -0.675432 -0.702810 0.147229 0.336078 0.433384 0.280669 -0.373819 -0.329348 -0.474994 -0.426611 -0.234110 -0.277908 -0.245057 0.244125 0.194366 0.201399 0.180203 0.202338 0.182200 0.271358 0.224112 0.281586 0.211641 0.225014 0.206287 0.263084 0.213870 0.202832 0.284021 0.308889 0.180239 0.237045 0.238879 0.225708 0.226164 0.229396
chargesum: 0.00000
title: Mulliken charges with hydrogens summed into heavy atoms:
elementType: O N N N C C C C C C C C C C C C C C C C C
charge: -0.294913 -0.091445 -0.126941 -0.212027 0.084085 0.057066 0.058413 0.099443 -0.032489 -0.023024 0.147229 0.336078 0.433384 0.280669 -0.064930 -0.149109 -0.237948 -0.187732 -0.008403 -0.051745 -0.015661
polarizability: 3.17826310e+02 7.09701736e+00 2.34660524e+02 1.54938307e+01 -4.63489496e+00 1.17681432e+02
1716.lowfreq: -18.2202 -4.8197 -0.0007 0.0005 0.0008 2.9367 10.4768 20.2194 24.4112
frequency: -6.9405 19.9114 23.9469 38.5566 61.7832 66.9174 74.9459 99.9836 106.8893 112.4571 157.9967 175.9175 218.4534 237.3762 244.2459 252.8811 274.6417 279.0224 303.4133 309.8939 346.5322 387.8837 408.4677 415.8216 421.7868 457.5590 471.4614 499.9090 509.7775 528.5705 532.6834 586.6068 626.0423 645.5443 682.9856 704.6294 733.4389 742.9913 758.7146 777.6299 781.6060 787.4006 797.9398 803.6136 804.4627 863.8723 865.4085 913.2491 924.0016 940.5046 946.7071 984.1139 986.8302 993.0969 1017.5796 1036.0344 1047.8364 1067.4938 1073.2751 1080.6570 1082.8812 1090.2943 1119.6239 1122.8130 1154.8941 1171.0260 1181.4872 1193.7147 1210.4985 1216.4472 1236.1918 1252.7852 1272.8260 1283.2578 1289.6861 1292.3852 1309.2446 1325.1610 1354.0970 1358.3341 1361.8125 1380.7141 1387.1754 1394.7782 1408.3034 1418.0950 1437.9282 1444.4644 1455.2522 1463.4829 1464.4251 1471.2458 1475.0635 1479.1743 1482.4327 1490.7336 1493.3492 1501.3813 1537.5151 1592.0488 1598.3069 1631.8114 1642.9074 2838.4031 2847.5410 2951.9286 2978.5625 2984.1838 3006.6198 3018.6141 3028.5561 3033.5263 3075.2004 3077.3821 3084.8273 3091.6208 3099.6786 3102.4891 3123.9495 3128.6649 3141.0825 3152.8711 3162.5744 3192.1921 3547.9053 3557.4703
redmass: 3.6181 4.4426 3.8533 3.9166 4.2795 2.6773 3.5969 2.8384 2.1451 3.3048 2.0270 4.0800 2.8270 1.6113 1.8627 2.4912 1.5429 3.2249 2.3060 2.7255 2.1514 2.6472 4.1275 3.1162 4.1539 2.6172 3.3887 4.0030 6.5554 4.1454 1.5460 2.2990 5.6434 3.5233 3.0697 10.0021 1.3315 2.3526 2.3428 3.0341 2.1647 2.9954 1.2072 1.3864 1.2139 3.4193 2.2348 2.0724 1.3409 3.7684 1.4184 1.3391 2.4249 1.3471 4.3867 3.0805 2.4124 2.0458 2.3900 2.4104 2.6050 1.6697 2.5333 1.7349 1.4081 1.6146 1.1049 1.2939 2.4005 2.0774 1.9028 1.3780 1.6269 1.2052 1.2560 2.3882 1.2547 1.2128 1.4233 1.9348 1.3741 1.3053 1.2416 1.2253 2.5546 5.5202 1.5480 1.6251 2.3022 1.0621 1.0607 1.0686 1.0964 1.6570 1.0662 1.0887 2.3893 1.0667 2.9584 7.2528 5.4828 7.1730 3.6620 1.0718 1.0709 1.0581 1.0356 1.0358 1.0991 1.0887 1.0656 1.0870 1.0989 1.0983 1.1009 1.1005 1.0865 1.1035 1.0872 1.0867 1.0934 1.0969 1.1002 1.0943 1.0770 1.0756
irintensity: 0.3804 0.0104 0.4704 2.0898 9.2912 0.4698 3.0266 0.9398 0.4954 2.2550 5.0283 2.6194 1.6656 0.6355 1.2239 0.7755 1.8725 1.8595 0.0809 10.6386 35.0161 16.7485 13.1702 7.0399 5.7392 3.4482 0.1697 6.0089 2.1874 6.4683 66.0102 72.0941 4.1722 3.0944 2.9500 20.7461 19.7944 4.3479 4.3989 6.5956 68.6632 3.2681 5.4242 53.9008 12.1104 6.3297 17.9634 0.5360 3.9530 2.8816 1.1789 0.1479 2.5015 6.1757 15.6585 6.8620 2.3169 28.5821 12.9803 18.0109 10.3023 36.2151 15.9860 14.9684 2.6155 16.1741 0.3413 6.6869 62.3890 299.4936 5.3571 16.9474 58.2487 16.3474 24.6494 43.8911 8.3646 13.3357 4.0070 68.2024 7.4038 4.4543 33.0502 14.3991 52.0384 93.0082 53.2962 4.8185 17.8864 9.8442 8.9858 3.0164 12.0563 140.7443 5.0870 41.7255 651.9751 8.8993 334.8044 32.3748 23.3214 45.5923 80.4801 36.4869 204.3629 43.6314 26.6432 36.5477 6.8118 30.7581 44.7380 44.7751 33.0172 60.5427 31.9125 44.9549 27.3550 10.7633 0.8908 2.5657 31.6092 33.9634 30.9376 8.7933 19.9479 15.3090
temp: 298.150 k
press: 1.00000 atm
elementType: 8 7 7 7 6 6 6 6 6 6 6 6 6 6 6 6 6 6 6 6 6 1 1 1 1 1 1 1 1 1 1 1 1 1 1 1 1 1 1 1 1 1 1 1
symmnumber: 1
zpe: 973579.9 jmol-1
zpe.correction: 0.370817 hartree
zpe.thermalcorrener: 0.391259 hartree
zpe.thermalcorrenthalpy: 0.392203 hartree
zpe.thermalcorrgfe: 0.319834 hartree
zpe.sumelectzpe: -899.534069 hartree
zpe.sumelectthermal: -899.513627 hartree
zpe.sumelectthermalent: -899.512683 hartree
zpe.sumelectthermalfe: -899.585053 hartree
dipole: 0.0438 -4.0672 -0.6441
dipole: 4.1181
quadrupole: -114.2195 -113.8371 -132.8415
quadrupole: -1.8297 -1.6259 -3.2979
quadrupole: 6.0798 6.4623 -12.5421 -1.8297 -1.6259 -3.2979
hfenergy: -899.9048865 hartree
pointgroup: C01 [X(C17H23N3O1)]
dipole: -0.0115883 -1.6021181 0.2409287 debye
polarizability: 318.0321407|10.0218338|220.9926103|13.1532993|-37.577726|131.1435146 unknown
InChI: InChI=1S/C17H23N3O/c1-3-20(4-2)13-12-18-17(21)19-16-11-7-9-14-8-5-6-10-15(14)16/h5-11,18-19H,3-4,12-13H2,1-2H3
charge 0 multiplicity 1
44 atoms
O  1.035827 1.25137 0.036541
N  5.107242 -0.414108 -0.205021
N  1.49715 -0.83235 0.971639
N  -0.721652 -0.291829 0.44259
C  3.679631 -0.808458 -0.295396
C  6.065465 -1.523226 -0.451368
C  5.425028 0.827542 -0.959033
C  2.942708 -0.552473 1.04713
C  7.44761 -1.289155 0.190908
C  4.703699 2.074791 -0.412677
C  -3.138531 -0.267226 -0.00937
C  -1.852903 0.410747 -0.048125
C  -4.30902 0.442954 -0.490156
C  0.62553 0.122681 0.448955
C  -1.761791 1.718366 -0.555725
C  -3.318608 -1.606299 0.477407
C  -4.178586 1.775873 -0.99917
C  -5.58731 -0.207243 -0.451309
C  -2.926202 2.388551 -1.030192
C  -4.576984 -2.214388 0.501804
C  -5.727299 -1.507586 0.034588
H  3.154048 -0.23724 -1.088052
H  3.589988 -1.881502 -0.562214
H  5.630387 -2.440267 -0.010757
H  6.194784 -1.72571 -1.546463
H  6.515743 0.992695 -0.894056
H  5.181479 0.707105 -2.04688
H  3.076767 0.504923 1.325762
H  3.387468 -1.173323 1.845156
H  1.16541 -1.763984 1.223274
H  7.973213 -0.425948 -0.254654
H  7.334583 -1.099285 1.27274
H  8.090584 -2.178056 0.049847
H  3.60422 1.983188 -0.473068
H  4.979643 2.243808 0.643824
H  4.99927 2.96625 -0.997069
H  -0.915777 -1.203456 0.856372
H  -0.787747 2.209325 -0.576966
H  -2.468623 -2.200474 0.837236
H  -5.07172 2.298413 -1.359587
H  -6.461766 0.344506 -0.816552
H  -2.820721 3.407173 -1.419289
H  -4.682235 -3.238058 0.877327
H  -6.710298 -1.99002 0.057249
