program: Gaussian 09
title: 000235657
version: EM64L-G09RevD.01
frameworkgroup: C1[X(C12H15NO4)]
method: RPBEPBE
basis: SDD
operation: Freq
keyword: #p
keyword: freq=noraman
keyword: PBEPBE/SDD
title: #p freq=noraman PBEPBE/SDD
converged: NO YES NO NO
title: Mulliken charges:
elementType: O O O O N C C C C C C C C C C C C H H H H H H H H H H H H H H H
charge: -0.281113 -0.241187 -0.203613 -0.194235 0.023218 -0.344795 -0.367946 -0.354760 -0.307071 -0.691731 0.247979 0.200024 -0.460002 -0.338000 0.382182 -0.180370 -0.350429 0.186562 0.197407 0.206035 0.231883 0.196438 0.202724 0.234643 0.224651 0.212363 0.209606 0.219612 0.322515 0.281813 0.244221 0.291376
chargesum: 0.00000
title: Mulliken charges with hydrogens summed into heavy atoms:
elementType: O O O O N C C C C C C C C C C C C
charge: -0.281113 -0.241187 -0.203613 -0.194235 0.023218 0.039174 0.069973 0.044402 0.152223 -0.050150 0.247979 0.200024 -0.137488 -0.056187 0.382182 0.063850 -0.059053
polarizability: 2.27231315e+02 -4.37615544e+00 1.53432931e+02 -1.69515734e+01 -1.05514585e+01 9.18855183e+01
1716.lowfreq: -10.2197 -4.0670 -0.0010 -0.0008 -0.0004 6.4051 23.2336 27.2143 33.9085
frequency: 23.0746 26.9091 33.6886 55.3733 59.3727 85.7346 119.2512 128.4171 131.9702 159.1131 180.7513 212.3108 225.3016 261.6855 307.2543 326.6619 372.4777 391.2236 423.0461 452.5694 470.9962 498.7846 539.6823 643.8686 655.1355 681.6280 696.4710 732.2291 739.4904 747.7956 773.1610 819.4693 830.2006 853.5910 886.7808 929.7208 965.4894 971.0702 975.6665 989.5440 1012.2569 1013.6352 1055.6089 1071.0776 1075.8758 1084.2518 1086.8363 1119.5095 1166.2548 1174.4061 1211.8968 1213.1620 1241.7182 1251.8035 1272.8384 1282.0747 1287.6597 1298.6655 1321.1037 1356.3256 1372.0153 1376.0774 1389.6807 1401.2114 1432.6726 1453.8728 1466.6652 1470.2249 1471.9474 1476.6464 1480.1422 1488.3150 1584.3514 1613.7121 1626.9728 2959.2174 2972.4932 2975.2529 2992.7007 3001.6179 3024.4898 3028.2571 3056.0603 3072.2610 3076.1403 3104.6954 3156.1739 3180.7980 3181.9610 3190.0034
redmass: 5.0654 6.0909 1.8308 11.5287 4.5556 3.1522 2.0612 3.6661 3.6455 5.4542 4.9923 5.7980 1.1252 4.4104 5.8502 3.1466 5.8445 5.7174 3.1782 4.9153 6.5097 5.5734 5.2911 6.8710 5.8751 7.2730 2.4452 1.0748 6.5968 2.8873 1.4305 5.3509 1.4989 1.3367 2.2115 4.1642 1.4131 1.1828 1.4390 6.2503 1.3769 3.7597 2.7986 2.4978 1.8317 2.1558 2.8582 2.5615 1.7399 1.1643 4.6508 1.5525 4.0130 1.2808 1.2060 1.3879 1.0528 1.1146 1.3422 1.5811 1.4690 6.7140 1.2176 8.2292 3.0092 1.1154 1.0737 1.1452 2.3069 1.0426 1.0720 1.0923 7.2858 7.1886 9.8132 1.0587 1.0592 1.0367 1.0614 1.0971 1.0578 1.1028 1.1034 1.1010 1.0992 1.1087 1.0887 1.0924 1.0927 1.0984
irintensity: 1.0966 0.2879 0.0322 0.8220 0.1352 0.3834 0.0798 0.2018 0.0575 1.7510 0.9342 2.1412 0.0156 4.0219 12.4716 4.2438 7.1615 0.3603 0.2088 3.6313 2.8562 1.7629 0.2925 3.7135 3.5188 26.0907 59.3263 9.4018 11.4113 20.3361 2.6661 1.2231 27.2680 1.8147 14.4496 47.0841 0.8717 1.6561 16.8299 1.6415 1.1986 3.9867 12.0893 31.1547 6.2514 209.3150 140.1766 2.3987 25.8490 25.0200 402.4563 24.0467 105.6223 12.8322 5.0312 20.4689 1.1908 0.8343 5.4796 0.1892 5.5404 104.0116 11.6955 0.7418 18.4547 16.9226 0.5108 2.2889 13.4757 12.8732 2.5535 23.5673 22.3061 26.1125 123.4394 11.3221 51.8376 36.2494 23.0072 3.4011 47.1642 17.7085 15.6675 84.5403 48.8129 26.0614 7.5960 5.0996 4.1806 5.3461
temp: 298.150 k
press: 1.00000 atm
elementType: 8 8 8 8 7 6 6 6 6 6 6 6 6 6 6 6 6 1 1 1 1 1 1 1 1 1 1 1 1 1 1 1
symmnumber: 1
zpe: 664229.8 jmol-1
zpe.correction: 0.252992 hartree
zpe.thermalcorrener: 0.270191 hartree
zpe.thermalcorrenthalpy: 0.271135 hartree
zpe.thermalcorrgfe: 0.204776 hartree
zpe.sumelectzpe: -820.575251 hartree
zpe.sumelectthermal: -820.558052 hartree
zpe.sumelectthermalent: -820.557108 hartree
zpe.sumelectthermalfe: -820.623467 hartree
dipole: -4.6056 4.9326 -0.4044
dipole: 6.7606
quadrupole: -112.4481 -101.4283 -100.1867
quadrupole: 13.8254 -0.4288 0.2435
quadrupole: -7.7604 3.2594 4.5010 13.8254 -0.4288 0.2435
hfenergy: -820.828243 hartree
pointgroup: C01 [X(C12H15N1O4)]
dipole: -1.8067329 1.3971027 1.3632513 debye
polarizability: 225.5354137|12.8833533|131.8962535|-19.2474945|30.5487188|115.1180965 unknown
InChI: InChI=1S/C12H15NO4/c1-2-3-4-8-17-12(14)10-6-5-7-11(9-10)13(15)16/h5-7,9H,2-4,8H2,1H3
charge 0 multiplicity 1
32 atoms
O  -1.410683 0.207834 1.121428
O  -0.769715 -1.495838 -0.343133
O  5.407847 0.181119 -1.186554
O  3.988621 -1.460458 -1.887432
N  4.25229 -0.394141 -1.212632
C  -5.119304 -0.259222 0.11098
C  -3.649624 0.214364 0.010075
C  -6.00044 0.290374 -1.034729
C  -2.800145 -0.3483 1.156733
C  -7.470306 -0.169716 -0.93116
C  0.850583 0.195101 0.339808
C  -0.494166 -0.46297 0.314039
C  1.886326 -0.391221 -0.424813
C  1.101452 1.369012 1.09676
C  3.15535 0.21572 -0.411017
C  2.385576 1.956308 1.09143
C  3.429102 1.38354 0.334986
H  -5.5482 0.057873 1.084525
H  -5.155927 -1.368179 0.096763
H  -3.611411 1.320739 0.037126
H  -3.219439 -0.110025 -0.955936
H  -5.956621 1.39845 -1.028805
H  -5.57647 -0.033674 -2.00641
H  -2.737874 -1.450123 1.104774
H  -3.180165 -0.03162 2.142212
H  -7.544974 -1.272827 -0.966547
H  -7.925817 0.167156 0.0190
H  -8.078785 0.235987 -1.759691
H  1.700057 -1.295153 -1.011448
H  0.286832 1.805371 1.680615
H  2.574419 2.861059 1.677363
H  4.433614 1.81396 0.310491
