program: Gaussian 09
title: 000235652
version: EM64L-G09RevD.01
frameworkgroup: C1[X(C11H13NO4)]
method: RPBEPBE
basis: SDD
operation: Freq
keyword: #p
keyword: freq=noraman
keyword: PBEPBE/SDD
title: #p freq=noraman PBEPBE/SDD
converged: YES YES NO NO
title: Mulliken charges:
elementType: O O O O N C C C C C C C C C C C H H H H H H H H H H H H H
charge: -0.285816 -0.240846 -0.203747 -0.193959 0.023181 -0.370553 -0.344771 -0.259578 -0.685945 0.246567 0.200555 -0.459466 -0.337285 0.381642 -0.180217 -0.350431 0.208757 0.208794 0.199070 0.198998 0.229931 0.229928 0.212150 0.212108 0.221516 0.322645 0.281055 0.244276 0.291441
chargesum: 0.00000
title: Mulliken charges with hydrogens summed into heavy atoms:
elementType: O O O O N C C C C C C C C C C C
charge: -0.285816 -0.240846 -0.203747 -0.193959 0.023181 0.046998 0.053298 0.200281 -0.040171 0.246567 0.200555 -0.136822 -0.056229 0.381642 0.064059 -0.058990
polarizability: 2.17386591e+02 -1.41514906e+00 1.48656788e+02 -7.54843767e-02 -4.50359590e-02 7.31408934e+01
1716.lowfreq: -18.1736 -3.0287 0.0006 0.0011 0.0012 3.2354 11.0835 39.3946 49.0178
frequency: -6.7701 38.9041 49.0175 53.7276 60.2296 103.9808 127.5139 131.3331 169.8910 193.1573 211.4991 235.2041 239.1468 288.6350 377.3268 386.5362 419.6678 424.0174 468.7699 487.5512 538.2971 643.7396 655.3533 682.7507 696.6353 738.2166 740.4871 771.9559 794.5211 830.4689 839.5119 906.5803 922.0135 931.0336 964.2540 978.7334 989.5253 1011.7532 1039.6263 1076.6919 1079.3093 1086.4556 1091.8215 1125.1263 1147.9319 1174.1158 1212.3807 1212.6483 1240.5435 1270.5432 1271.6956 1282.6511 1286.7959 1344.3734 1372.9387 1375.5699 1394.2093 1401.6863 1433.0966 1467.3403 1470.0026 1471.4934 1479.6724 1479.9520 1488.9667 1584.5181 1613.1649 1625.0031 2971.0153 2978.1212 2990.7002 3005.1099 3014.6058 3045.8882 3072.8566 3079.2119 3081.0839 3155.7377 3179.6189 3180.7623 3189.2333
redmass: 2.9787 2.5502 4.9819 12.4483 4.3272 2.1288 3.6622 5.7915 4.8122 5.0331 3.6006 5.1337 1.1749 7.2106 6.5744 5.9722 3.2588 3.1876 5.6529 9.4729 5.7674 7.2194 5.7344 9.4303 2.4528 1.1980 3.9405 10.5537 1.1416 1.5076 7.2920 2.0547 5.1866 1.1635 1.4079 1.4394 6.2722 1.3657 3.2968 1.9904 2.0288 1.6356 5.2559 2.6532 1.4991 1.1430 6.2168 1.3570 3.8090 1.1544 1.3150 1.3899 1.0823 1.4538 1.9563 4.4722 1.2168 8.6478 2.9852 1.0842 1.5832 1.4935 1.0705 1.0419 1.0903 7.4302 7.2190 10.6424 1.0587 1.0367 1.0596 1.0568 1.1005 1.1037 1.1032 1.0994 1.1062 1.0886 1.0924 1.0928 1.0983
irintensity: 0.7612 0.1757 0.5426 0.6666 0.0624 0.0545 0.4481 0.5404 3.7383 1.0760 2.2369 7.3682 0.3387 4.7244 0.4136 5.8828 8.8411 0.1417 0.0523 3.2493 0.5462 3.5468 2.7901 28.3722 58.8085 15.9474 3.6474 19.0561 0.9793 27.1044 1.6177 24.3414 34.2164 0.4557 0.2642 18.0504 1.2483 0.5819 18.7973 48.0711 90.4675 19.7262 249.3764 3.7025 2.5150 37.5119 445.1662 8.3630 102.7624 0.1195 6.8571 28.8597 0.1522 1.7746 24.0865 89.5666 7.6903 0.8357 19.4708 0.8740 12.2486 8.9888 5.3137 13.5009 17.8564 25.4271 30.7825 139.4534 25.7114 30.7396 22.1156 31.5070 5.6698 4.9073 9.8273 47.8262 109.8721 6.9347 2.7178 6.9255 5.3494
temp: 298.150 k
press: 1.00000 atm
elementType: 8 8 8 8 7 6 6 6 6 6 6 6 6 6 6 6 1 1 1 1 1 1 1 1 1 1 1 1 1
symmnumber: 1
zpe: 590035.4 jmol-1
zpe.correction: 0.224733 hartree
zpe.thermalcorrener: 0.239761 hartree
zpe.thermalcorrenthalpy: 0.240705 hartree
zpe.thermalcorrgfe: 0.180830 hartree
zpe.sumelectzpe: -781.352125 hartree
zpe.sumelectthermal: -781.337097 hartree
zpe.sumelectthermalent: -781.336153 hartree
zpe.sumelectthermalfe: -781.396028 hartree
dipole: 5.7553 4.1292 -0.0069
dipole: 7.0834
quadrupole: -106.8824 -95.0330 -93.1314
quadrupole: -10.3073 0.0193 -0.0022
quadrupole: -8.5335 3.3159 5.2176 -10.3073 0.0193 -0.0022
hfenergy: -781.576858 hartree
pointgroup: C01 [X(C11H13N1O4)]
dipole: 2.2431451 -1.6324198 0.264215 debye
polarizability: 217.1616157|1.2241071|147.8315466|5.8904785|-7.7244689|74.1911096 unknown
InChI: InChI=1S/C11H13NO4/c1-2-3-7-16-11(13)9-5-4-6-10(8-9)12(14)15/h4-6,8H,2-3,7H2,1H3
charge 0 multiplicity 1
29 atoms
O  1.884837 -0.016175 0.066051
O  0.759852 2.010553 -0.189429
O  -5.306834 -0.205259 -0.216387
O  -4.237699 1.80222 -0.384202
N  -4.239033 0.520196 -0.248438
C  4.296858 -0.312929 0.192874
C  5.696698 0.347913 0.180758
C  3.184952 0.724343 0.045052
C  6.832935 -0.686692 0.328032
C  -0.506902 -0.069302 -0.02887
C  0.73732 0.762393 -0.062092
C  -1.748758 0.596864 -0.150737
C  -0.467262 -1.480233 0.119781
C  -2.927447 -0.170885 -0.120676
C  -1.666545 -2.225274 0.146713
C  -2.912583 -1.575935 0.02649
H  4.223917 -1.048417 -0.631279
H  4.154953 -0.870274 1.138783
H  5.762841 1.090104 1.00177
H  5.830995 0.912703 -0.763865
H  3.178751 1.457517 0.872671
H  3.250678 1.280656 -0.908292
H  6.742051 -1.243513 1.279298
H  6.807916 -1.423014 -0.49681
H  7.823919 -0.198344 0.315517
H  -1.786165 1.683902 -0.264999
H  0.503093 -1.975118 0.212647
H  -1.631137 -3.31299 0.26155
H  -3.858299 -2.123911 0.043789
