program: Gaussian 09
title: 000235651
version: EM64L-G09RevD.01
frameworkgroup: C1[X(C8H6ClNO5)]
method: RPBEPBE
basis: SDD
operation: Freq
keyword: #p
keyword: freq=noraman
keyword: PBEPBE/SDD
title: #p freq=noraman PBEPBE/SDD
converged: YES YES NO NO
title: Mulliken charges:
elementType: Cl O O O O O N C C C C C C C C H H H H H H
charge: -0.019346 -0.327673 -0.299372 -0.197424 -0.172922 -0.259796 0.028467 0.204372 0.017770 0.299523 -0.263910 -0.344624 -0.090893 0.193179 -0.496556 0.310139 0.313897 0.375624 0.235537 0.245506 0.248502
chargesum: 0.00000
title: Mulliken charges with hydrogens summed into heavy atoms:
elementType: Cl O O O O O N C C C C C C C C
charge: -0.019346 0.047951 -0.299372 -0.197424 -0.172922 -0.259796 0.028467 0.204372 0.017770 0.299523 0.046229 -0.030727 -0.090893 0.193179 0.232989
polarizability: 1.83598418e+02 -3.60736840e+00 1.62941011e+02 -5.98537923e-01 -9.88328655e-01 5.15858173e+01
1716.lowfreq: -6.9010 -5.4179 -3.9017 0.0023 0.0025 0.0027 16.8466 55.8120 89.3138
frequency: 16.5334 55.8094 89.3116 99.2508 115.3703 131.4681 152.9669 172.7196 204.0199 259.7419 298.1922 334.4868 345.2385 351.1392 374.9369 411.5691 440.2557 462.8617 539.1182 615.3358 655.1119 680.0612 684.4560 704.3033 757.2422 763.6255 815.0636 857.8343 864.2999 910.6680 941.6335 950.9402 1061.3852 1104.8815 1115.0878 1139.7271 1146.7638 1165.7605 1236.6453 1265.7199 1309.9707 1364.0686 1400.2661 1408.1719 1423.8305 1451.7178 1463.7422 1485.5698 1579.3349 1596.4330 1646.3086 2901.0106 3007.0636 3109.5463 3152.7822 3187.0531 3192.9903
redmass: 5.9731 7.9696 2.3120 1.8167 4.5945 9.6991 5.4696 14.6088 4.7425 5.8407 6.8782 8.0650 8.6915 12.3343 7.2197 7.8321 8.7389 6.9659 3.7546 5.7826 8.5616 9.2933 8.6470 9.2276 7.5768 7.9320 7.4844 8.3861 1.0691 1.4468 1.5661 5.2359 3.9278 2.3643 1.2677 7.0542 1.5043 2.2745 2.7692 2.9750 2.8728 5.1975 6.9952 2.7691 1.1746 1.0493 1.0517 4.0147 5.5124 6.2519 10.6232 1.0668 1.0296 1.1046 1.1049 1.0930 1.0929
irintensity: 1.0646 0.0732 0.6903 0.0821 0.5822 0.2264 8.6242 1.4269 1.8407 8.0218 4.4697 6.7575 5.9705 5.1813 10.2029 0.1137 1.6286 0.0538 20.6327 12.5209 1.4087 49.2696 15.9637 0.7038 25.2269 13.2044 12.6997 30.5277 127.6166 31.9930 0.8922 6.1674 195.6824 51.2661 0.7784 465.6009 4.2321 102.5229 137.6764 59.4836 118.8834 124.8452 38.6671 145.7675 24.2386 15.2308 12.1451 62.4858 50.2766 76.1329 168.6756 203.4737 34.0700 23.3357 13.1647 13.9424 4.0216
temp: 298.150 k
press: 1.00000 atm
elementType: 17 8 8 8 8 8 7 6 6 6 6 6 6 6 6 1 1 1 1 1 1
symmnumber: 1
zpe: 352727.3 jmol-1
zpe.correction: 0.134347 hartree
zpe.thermalcorrener: 0.148325 hartree
zpe.thermalcorrenthalpy: 0.149270 hartree
zpe.thermalcorrgfe: 0.091453 hartree
zpe.sumelectzpe: -1198.205019 hartree
zpe.sumelectthermal: -1198.191040 hartree
zpe.sumelectthermalent: -1198.190096 hartree
zpe.sumelectthermalfe: -1198.247912 hartree
dipole: -3.0408 2.7493 -0.3139
dipole: 4.1114
quadrupole: -89.2991 -103.4913 -91.5921
quadrupole: -0.8427 1.4954 1.6474
quadrupole: 5.4951 -8.6971 3.2021 -0.8427 1.4954 1.6474
hfenergy: -1198.3393656 hartree
pointgroup: C01 [X(C8H6Cl1N1O5)]
dipole: -1.2703515 0.9923141 -0.1343134 debye
dipolederiv: -0.0719943 -0.0387499 -0.000437 0.0119958 -0.7940372 -0.0133806 0.0026041 -0.0138395 -0.0429776 -0.3495179 0.1018088 -0.0047295 0.0120374 -1.0801368 -0.0316812 0.0082157 -0.0448131 -0.327377 -1.5503934 0.1221255 -0.1461017 0.4182903 -0.5390148 0.1212923 -0.2489856 0.0734484 -0.3437916 -0.6973036 -0.2640443 0.0195645 -0.0336628 -0.7584827 0.1544989 -0.0700985 0.1112638 -0.3306848 -1.0367475 -0.045547 -0.0068097 -0.2507268 -0.3926055 -0.0097548 -0.0065653 -0.0070173 -0.2043254 -0.4858352 0.0285775 -0.0017845 0.2586944 -0.9190035 -0.0233276 0.005337 -0.0227231 -0.2663463 1.9136407 -0.2993107 -0.0009227 -0.3849912 1.1355474 0.0356683 -0.0075676 0.0292155 0.2096704 -0.3891436 0.0703453 -0.0012204 -0.3981502 -0.360065 0.0109384 0.000049 0.0138486 -0.0362193 0.2924538 -0.2068352 -0.0113034 0.0295107 0.9636873 0.0443058 0.0236719 0.0523445 0.1340735 -0.8002611 0.167399 0.0019166 0.570861 -0.3313037 -0.0123853 0.0087687 -0.0172963 0.0211839 0.3413685 -0.0588281 0.0022911 0.4580364 -0.1159583 0.0049876 -0.0235721 -0.020387 -0.0176211 0.1434278 0.0037255 0.0000428 -0.615371 -0.0927432 -0.0002524 -0.0138437 0.0042371 -0.0320605 -0.689721 0.1156545 0.0025754 0.0774292 1.2828815 0.0236724 0.0040538 0.0196524 -0.0918448 2.0088236 0.1741212 0.1280222 -0.2262692 1.0288846 -0.3081786 0.2546229 -0.1987643 0.3322618 0.7751841 0.0074304 0.0339375 0.0814638 0.2220018 0.0153562 0.040647 0.0075958 0.2760435 0.1306055 0.0441797 0.0055906 0.0683734 0.1193021 -0.0005202 0.0123012 0.0089679 0.1537494 0.1117039 -0.0444782 -0.0011689 0.0190837 0.1281956 -0.0011282 -0.0016683 0.0000079 0.1751943 0.4140244 0.0530253 0.00499 -0.0455136 0.4410526 0.001439 -0.0026582 0.0032029 0.3674225 -0.0172927 0.0529526 -0.0295175 0.1216416 -0.0170478 0.053455 -0.0433213 0.0454759 0.1059534 -0.0323713 -0.0024372 -0.0038433 -0.0823004 0.0831099 0.0514859 0.0731229 0.0414338 -0.0897926 -0.0106507 0.0188854 0.0089077 -0.0904324 -0.0042643 -0.1164907 -0.0151135 -0.085854 0.0074883 unknown
polarizability: 184.0000979|-2.0564191|162.5348344|1.4650757|-0.1129638|51.5903142 unknown
InChI: InChI=1S/C8H6ClNO5/c1-15-8(12)5-2-4(9)3-6(7(5)11)10(13)14/h2-3,11H,1H3
charge 0 multiplicity 1
21 atoms
Cl 0.512154 3.856888 0.082096
O  0.245494 -2.155043 -0.059186
O  -3.227273 0.271877 -0.275033
O  -2.490872 -1.852534 0.334606
O  3.951543 -0.19789 0.014995
O  2.781034 -2.151154 -0.054376
N  2.836968 -0.828713 -0.008841
C  -0.881603 -0.012978 0.019646
C  0.320508 -0.798534 -0.002843
C  1.57818 -0.091537 0.012017
C  -0.793493 1.395924 0.036937
C  1.652799 1.321368 0.043251
C  0.459877 2.044832 0.051085
C  -2.230338 -0.665094 0.050204
C  -4.613267 -0.251657 -0.244302
H  -1.719997 1.974113 0.040877
H  2.633628 1.802905 0.057209
H  1.208558 -2.516586 -0.072583
H  -5.239852 0.5974 -0.550325
H  -4.869963 -0.591738 0.773021
H  -4.715783 -1.097148 -0.944556
