program: Gaussian 09
title: 000235650
version: EM64L-G09RevD.01
frameworkgroup: C1[X(C12H14ClNO5)]
method: RPBEPBE
basis: SDD
operation: Freq
keyword: #p
keyword: freq=noraman
keyword: PBEPBE/SDD
title: #p freq=noraman PBEPBE/SDD
converged: YES YES NO NO
title: Mulliken charges:
elementType: Cl O O O O O N C C C C C C C C C C C C H H H H H H H H H H H H H H
charge: -0.026082 -0.223567 -0.272337 -0.231227 -0.204675 -0.165063 0.008669 -0.373515 -0.264085 -0.343320 0.153229 0.190453 0.274469 -0.684006 -0.333196 -0.317923 -0.108235 0.158774 -0.505410 0.223204 0.209184 0.208025 0.240890 0.197007 0.193788 0.215524 0.215504 0.219314 0.300009 0.306584 0.244232 0.253642 0.240141
chargesum: 0.00000
title: Mulliken charges with hydrogens summed into heavy atoms:
elementType: Cl O O O O O N C C C C C C C C C C C C
charge: -0.026082 -0.223567 -0.272337 -0.231227 -0.204675 -0.165063 0.008669 0.058874 0.184830 0.047475 0.153229 0.190453 0.274469 -0.033664 -0.033188 -0.011339 -0.108235 0.158774 0.232605
polarizability: 2.23810317e+02 -6.95490055e+00 1.93532191e+02 -2.68498017e+01 -8.68489696e+00 1.11655133e+02
1716.lowfreq: -9.8744 -3.2453 -0.0010 0.0003 0.0016 4.2476 23.1147 29.3975 48.8085
frequency: 22.8372 29.0160 48.7623 55.0680 58.8290 68.1209 90.4383 109.1219 115.1760 120.1418 144.5343 153.5252 163.4643 180.5133 210.7708 227.3483 228.8320 265.5675 303.4584 310.9368 325.5381 363.9981 377.3501 390.1912 438.3781 458.8137 491.6231 549.4308 621.3726 646.9640 675.3559 691.4962 727.0787 737.8205 743.7241 767.8623 808.2869 826.1619 851.6728 901.7604 905.8638 926.1478 930.1205 937.1131 940.8970 1035.1705 1076.3706 1083.8395 1103.6060 1113.2630 1118.9168 1142.3798 1149.6525 1185.1562 1208.4296 1211.0193 1234.2134 1250.3204 1270.4761 1277.3364 1286.1019 1339.2339 1359.7327 1365.9741 1368.6400 1390.7585 1394.3833 1422.7623 1440.2624 1452.1962 1463.2852 1469.3933 1472.8407 1477.0098 1480.6375 1490.6589 1559.3281 1591.5664 1613.7430 2966.5637 2979.2507 2981.1180 2999.3846 3007.8958 3011.6082 3056.9603 3076.7582 3079.3880 3095.2925 3111.6325 3154.9400 3172.0255 3185.2832
redmass: 5.7239 5.5794 3.7649 6.9073 2.1737 4.1114 3.1132 3.0716 1.2759 2.5950 4.2802 8.0068 5.1116 4.5149 4.7439 1.1955 5.3044 5.8432 6.5160 8.4392 7.2882 4.5457 8.0014 7.1566 4.0269 8.0870 6.2506 3.8869 6.6066 7.6059 10.5757 8.8308 8.1016 6.7656 1.0761 5.9106 1.1923 6.4385 9.6264 1.8168 1.5422 1.8238 3.0165 1.9346 2.3969 3.4670 2.3116 5.0633 2.0108 1.2808 2.4231 1.4814 1.4700 3.9626 1.6466 2.7547 2.2217 3.5792 1.3890 1.2064 1.0725 1.4168 1.6785 5.9803 10.4895 3.1073 1.2918 1.2490 3.1285 1.0518 1.0542 1.0984 1.0773 1.0440 1.0762 1.0956 8.8285 7.7019 9.8571 1.0590 1.0368 1.0636 1.0601 1.0295 1.1006 1.1009 1.1007 1.0996 1.1020 1.1047 1.1052 1.0928 1.0933
irintensity: 0.2223 0.5049 0.6630 1.2960 1.3577 1.3155 0.3699 1.4299 0.1635 1.2921 2.4812 3.4131 4.4131 0.0490 7.0279 0.4934 0.5063 6.5019 4.8202 1.7504 0.2358 5.4855 3.7805 0.9930 0.5883 0.5606 2.8000 19.2562 3.3840 25.1322 39.6096 16.8599 1.5573 0.8672 9.2540 17.1460 2.5070 46.9852 27.2054 13.2443 26.8487 2.3990 39.8075 27.7514 23.1862 17.5527 11.1317 73.0542 46.2279 0.2696 9.3586 3.9998 32.5561 117.5587 43.6027 178.0151 56.6359 284.1505 24.2022 3.4968 0.2840 16.8529 67.5677 75.8313 54.2500 54.6768 10.2318 64.4097 218.0016 18.7604 9.6191 5.1160 5.7686 15.1828 1.0989 20.7030 22.9637 44.3466 195.6163 24.6343 34.9935 22.1054 28.9888 27.9090 12.1898 5.9983 49.9089 45.0992 51.2157 21.4942 10.0580 4.5538 6.5668
temp: 298.150 k
press: 1.00000 atm
elementType: 17 8 8 8 8 8 7 6 6 6 6 6 6 6 6 6 6 6 6 1 1 1 1 1 1 1 1 1 1 1 1 1 1
symmnumber: 1
zpe: 644298.2 jmol-1
zpe.correction: 0.245400 hartree
zpe.thermalcorrener: 0.265705 hartree
zpe.thermalcorrenthalpy: 0.266649 hartree
zpe.thermalcorrgfe: 0.193689 hartree
zpe.sumelectzpe: -1355.067895 hartree
zpe.sumelectthermal: -1355.047590 hartree
zpe.sumelectthermalent: -1355.046646 hartree
zpe.sumelectthermalfe: -1355.119607 hartree
dipole: -3.4308 4.1798 -0.3640
dipole: 5.4198
quadrupole: -107.8991 -130.0446 -121.1710
quadrupole: -6.1378 3.2194 12.2208
quadrupole: 11.8058 -10.3397 -1.4661 -6.1378 3.2194 12.2208
hfenergy: -1355.3132954 hartree
pointgroup: C01 [X(C12H14Cl1N1O5)]
dipole: 1.0878996 -1.799345 0.354392 debye
polarizability: 199.7464701|-5.8965824|195.7769098|52.5489425|-5.7924239|133.4742606 unknown
InChI: InChI=1S/C12H14ClNO5/c1-3-4-5-19-11-9(12(15)18-2)6-8(13)7-10(11)14(16)17/h6-7H,3-5H2,1-2H3
charge 0 multiplicity 1
33 atoms
Cl -4.444468 0.204682 -2.297192
O  0.755684 0.403544 0.742338
O  -0.045701 -2.382463 1.423877
O  -0.856651 -3.410773 -0.499477
O  -0.931776 3.772626 -0.477227
O  -0.128367 2.864657 1.45769
N  -0.70935 2.770987 0.314897
C  3.149654 0.377979 0.338487
C  1.901767 -0.502564 0.428112
C  4.426224 -0.467047 0.109113
C  -0.480161 0.24334 0.162799
C  -1.0824 -0.994315 -0.241286
C  -1.206139 1.44661 -0.12652
C  5.696748 0.40706 0.036642
C  -2.277008 -0.984699 -1.009492
C  -2.399946 1.448571 -0.871194
C  -2.914292 0.223472 -1.322113
C  -0.632744 -2.366283 0.159118
C  0.306406 -3.729152 1.9436
H  3.244077 0.95539 1.277372
H  3.029561 1.112742 -0.480276
H  1.700605 -1.03259 -0.525131
H  1.976896 -1.238418 1.244808
H  4.325515 -1.05016 -0.82901
H  4.533277 -1.206263 0.929238
H  5.630548 1.135267 -0.792833
H  5.838946 0.97721 0.973352
H  6.599044 -0.209822 -0.125469
H  -2.693525 -1.944641 -1.328302
H  -2.883195 2.401851 -1.099619
H  1.038829 -4.218066 1.27942
H  -0.598643 -4.355187 2.007369
H  0.729488 -3.539645 2.93951
