program: Gaussian 09
title: 000235646
version: EM64L-G09RevD.01
frameworkgroup: C1[X(C10H11Cl2NO)]
method: RPBEPBE
basis: SDD
operation: Freq
keyword: #p
keyword: freq=noraman
keyword: PBEPBE/SDD
title: #p freq=noraman PBEPBE/SDD
converged: NO YES NO NO
title: Mulliken charges:
elementType: Cl Cl O N C C C C C C C C C C H H H H H H H H H H H
charge: -0.062960 -0.071289 -0.253093 -0.448437 0.327147 0.270552 -0.506028 -0.361396 0.211132 -0.202201 -0.779821 -0.219137 -0.259313 -0.559680 0.299526 0.257054 0.256935 0.313230 0.265202 0.265217 0.195687 0.236489 0.259341 0.282876 0.282966
chargesum: 0.00000
title: Mulliken charges with hydrogens summed into heavy atoms:
elementType: Cl Cl O N C C C C C C C C C C
charge: -0.062960 -0.071289 -0.253093 -0.148911 0.327147 0.270552 0.007961 -0.048165 0.211132 -0.202201 -0.053715 0.017352 0.000027 0.006163
polarizability: 2.12507516e+02 -2.82164655e-01 1.43251334e+02 -1.92014972e-02 -8.24598438e-03 6.53835875e+01
1716.lowfreq: -119.8469 -31.9881 -0.0027 -0.0009 0.0019 4.3781 7.6306 12.7832 33.3440
frequency: -119.8317 -31.9582 33.2697 53.7673 63.7229 88.8688 136.9576 179.7227 194.4257 211.8180 263.6438 292.3590 308.5134 348.7900 377.3573 475.5688 501.6754 525.1971 543.4412 580.1503 592.6618 650.0343 678.1723 719.9596 747.5769 785.6428 786.8328 793.4082 843.3160 915.4516 931.0740 989.9664 992.2971 999.3021 1032.7239 1073.4467 1079.1967 1122.2451 1135.0554 1168.3662 1199.7949 1214.8714 1249.0505 1274.5744 1291.6972 1326.5559 1361.6454 1408.4436 1423.1364 1445.1536 1453.1066 1457.5168 1459.3573 1477.7281 1510.1809 1582.8206 1608.1227 1623.8857 2990.6054 2991.9094 3047.9840 3071.9500 3081.3883 3084.0154 3150.1580 3168.8436 3178.7389 3198.8967 3538.9887
redmass: 1.0471 1.9564 6.7301 8.2192 10.4592 3.6518 3.8358 7.4664 11.6331 4.1316 6.0794 3.8735 7.0083 5.0084 7.0937 3.9385 3.3312 6.0464 3.6069 2.9077 7.5235 1.3135 7.4471 2.6438 4.9383 1.2769 4.7795 1.4599 4.9480 1.3544 5.0658 1.5410 1.3153 1.7160 1.4818 2.2043 4.1543 1.1623 2.2845 1.6991 1.6358 1.7627 1.3341 1.1479 2.2232 1.6257 6.4081 1.4266 2.2399 1.7692 1.2671 1.0418 1.0975 1.3103 2.0919 5.0195 7.2321 3.9554 1.0376 1.0594 1.1012 1.0980 1.0974 1.0573 1.0887 1.1116 1.0957 1.0956 1.0752
irintensity: 1.5055 0.4997 0.7100 5.6302 0.5853 5.6215 2.5951 12.7118 0.4992 1.3236 4.9037 7.2222 2.0248 7.5886 4.9014 1.6565 0.0124 4.5019 1.0642 1.6029 53.0324 68.4886 20.3403 2.3416 21.3828 2.7113 0.6290 80.1556 30.2055 3.5137 9.9477 1.1167 3.1638 50.5570 6.7557 12.5917 1.4385 0.3606 36.5789 67.7459 7.8708 4.2597 1.1725 0.8196 44.7981 46.2837 64.7488 49.8906 216.1343 10.4532 5.6904 13.2278 10.4603 24.9413 279.1409 267.9002 16.3709 84.0386 23.3777 12.1164 6.6652 8.5279 37.2138 7.5682 7.9770 8.3239 3.4049 10.9979 29.6639
temp: 298.150 k
press: 1.00000 atm
elementType: 17 17 8 7 6 6 6 6 6 6 6 6 6 6 1 1 1 1 1 1 1 1 1 1 1
symmnumber: 1
zpe: 496971.2 jmol-1
zpe.correction: 0.189286 hartree
zpe.thermalcorrener: 0.202230 hartree
zpe.thermalcorrenthalpy: 0.203175 hartree
zpe.thermalcorrgfe: 0.147685 hartree
zpe.sumelectzpe: -1436.746861 hartree
zpe.sumelectthermal: -1436.733917 hartree
zpe.sumelectthermalent: -1436.732973 hartree
zpe.sumelectthermalfe: -1436.788463 hartree
dipole: 1.2167 -1.7019 -0.0015
dipole: 2.0920
quadrupole: -117.7720 -92.6956 -98.0235
quadrupole: 3.8493 0.0013 -0.0077
quadrupole: -14.9416 10.1347 4.8069 3.8493 0.0013 -0.0077
hfenergy: -1436.9361478 hartree
pointgroup: C01 [X(C10H11Cl2N1O1)]
dipole: 0.4597861 -0.6819673 0.0309151 debye
dipolederiv: -0.6018222 0.3004156 -0.0177592 0.3667434 -0.3799157 0.0159709 -0.020265 0.015127 -0.0778806 -0.6272477 -0.1041383 -0.001554 -0.2277082 -0.2565699 0.000048 0.0031589 0.0015887 -0.1817707 -0.8656087 -0.0155771 -0.0060318 0.6591938 -0.8483195 0.0276255 -0.0311849 0.0194872 -0.3240737 -2.0360132 0.1442345 -0.02646 0.3208541 -0.3947721 0.0076432 -0.0331302 0.0056233 -0.2977318 1.1281853 0.1238203 0.0080048 0.3694092 0.0731168 0.0047396 -0.0009841 0.0018028 0.0811991 -0.4934681 0.0425424 -0.0071967 0.1450493 0.1365748 -0.0048471 -0.0111021 -0.0063592 -0.0335515 -0.3166413 -0.0651591 -0.0029388 -0.3711134 -0.2010411 0.0076457 0.0090135 0.0115208 0.1170544 -0.246129 -0.0005671 -0.0010607 -0.2027565 -0.1270911 -0.0037539 0.0065119 -0.0012455 -0.1612838 1.9804318 -0.1580486 0.0277933 -0.9097422 1.0667938 -0.0445998 0.0557538 -0.0356444 0.1716514 0.905154 -0.4363412 0.0284872 -0.5618403 0.5046343 -0.0290801 0.0332786 -0.0275186 -0.0784014 0.1328788 0.0553829 -0.0010205 0.0575779 -0.1576887 0.0086928 -0.0010477 0.008929 0.0502954 0.1408535 -0.0629179 0.0058443 0.0821058 0.1331636 -0.0096919 0.0002422 -0.0114635 -0.1463326 -0.2756852 0.1330817 -0.0068782 0.1188873 -0.2505884 0.0060712 -0.0062995 0.00628 -0.1292778 0.7901385 0.2331059 -0.0015376 0.2922093 0.3020471 -0.0005188 -0.0038463 -0.0013138 0.1949226 0.2346728 -0.0429244 0.0012433 -0.1189048 0.1301987 0.0037789 0.0039887 0.0046078 0.2714112 0.0126097 0.0021748 -0.0310167 0.0332826 0.0319806 0.0814536 -0.0315866 0.0875626 -0.0190778 0.0110527 0.0069464 0.0314263 0.0378439 0.0186994 -0.0834951 0.0294902 -0.0904027 -0.0043679 0.1617534 0.0654238 -0.0026969 0.0409649 0.0904682 0.0039316 -0.0018165 0.0041848 0.1803688 0.0677298 0.0390121 0.0805778 0.0106827 0.0157154 -0.0430117 0.053167 -0.0813597 -0.0062024 0.071236 0.0304686 -0.0810008 0.0055356 0.0249202 0.0407232 -0.0516927 0.0797689 -0.0192676 -0.2064132 -0.1044213 -0.0001175 -0.0442635 0.0718394 0.0006877 -0.0023791 -0.000135 0.103515 0.0587489 -0.0195696 -0.0004216 -0.041537 -0.0940623 0.0091044 0.0004478 0.0093667 0.1571315 -0.0341631 -0.0491786 -0.0005782 -0.0309424 0.0886884 0.0027992 -0.0012749 0.0025694 0.1714549 0.0039834 -0.0597786 0.0024025 -0.0172729 0.0160518 0.0703832 -0.0145208 0.0691988 -0.0156251 0.0037629 -0.0579875 0.0024895 -0.0142586 0.0051564 -0.0723002 0.0160778 -0.0721755 -0.0041596 unknown
polarizability: 212.416541|-2.1428574|143.2060734|1.8567267|-2.9892067|65.5198239 unknown
InChI: InChI=1S/C10H11Cl2NO/c1-7-8(12)3-2-4-9(7)13-10(14)5-6-11/h2-4,13H,5-6H2,1H3
charge 0 multiplicity 1
25 atoms
Cl 4.442647 -1.4789 0.144961
Cl -5.911573 -0.850582 -0.005546
O  -1.979022 1.621538 -0.049541
N  -0.694025 -0.357296 0.040172
C  0.648647 0.124206 0.038228
C  1.715383 -0.83539 0.08765
C  -3.137686 -0.547659 0.017798
C  0.923689 1.51848 -0.011467
C  -1.891459 0.357741 -0.001113
C  3.029149 -0.309885 0.083392
C  1.511698 -2.341344 0.142997
C  2.255883 1.973306 -0.012976
C  3.331805 1.061819 0.034576
C  -4.413394 0.296483 -0.03091
H  -0.798926 -1.372631 0.076717
H  -3.13858 -1.171219 0.932805
H  -3.115795 -1.239676 -0.846274
H  0.088406 2.218664 -0.04795
H  2.000799 -2.830583 -0.718416
H  1.977122 -2.762321 1.052281
H  0.456345 -2.663049 0.141255
H  2.45918 3.048296 -0.051617
H  4.370839 1.400931 0.034019
H  -4.4921 0.884486 -0.954657
H  -4.514731 0.953784 0.84252
