program: Gaussian 09
title: 000235644
version: EM64L-G09RevD.01
frameworkgroup: C1[X(C6H15NO)]
method: RPBEPBE
basis: SDD
operation: Freq
keyword: #p
keyword: freq=noraman
keyword: PBEPBE/SDD
title: #p freq=noraman PBEPBE/SDD
converged: YES YES NO NO
title: Mulliken charges:
elementType: O N C C C C C C H H H H H H H H H H H H H H H
charge: -0.443083 -0.317639 -0.041583 -0.063074 -0.727791 -0.323168 -0.704332 -0.697217 0.167933 0.173761 0.235617 0.212091 0.234580 0.236142 0.221363 0.176387 0.221882 0.234409 0.229785 0.201134 0.232379 0.214526 0.325899
chargesum: 0.00000
title: Mulliken charges with hydrogens summed into heavy atoms:
elementType: O N C C C C C C
charge: -0.117183 -0.082022 0.126350 0.110687 -0.044979 0.074582 -0.018256 -0.049179
polarizability: 8.99386407e+01 1.45178775e+00 7.38290289e+01 1.13315561e-02 -1.20811074e+00 6.93411346e+01
1716.lowfreq: -19.9530 -9.9555 -6.4469 0.0008 0.0012 0.0013 66.9269 82.1175 116.3898
frequency: 66.8541 82.0333 116.2870 133.4902 197.2880 244.9606 258.2199 273.0060 279.0051 314.5189 340.8834 367.5702 437.5825 526.3266 582.3483 678.5576 797.9739 814.2700 864.2010 898.0211 939.1822 995.1975 1013.6982 1061.4813 1079.8657 1103.7411 1113.0693 1125.8920 1168.7463 1184.0636 1244.3448 1256.1047 1296.8168 1308.6244 1345.8784 1357.8371 1371.1676 1381.4851 1391.2640 1403.4090 1457.5221 1460.5623 1468.7659 1474.5133 1478.8424 1482.1988 1491.5342 1500.2940 2768.8230 2848.8712 2896.6041 2977.7079 2989.5157 3000.1301 3021.0216 3070.9984 3084.4787 3092.2681 3095.3768 3101.1023 3105.7824 3397.5638 3539.0706
redmass: 3.1645 1.6651 2.7881 2.5949 1.2210 1.1690 1.1863 2.3940 2.2076 1.8587 1.5569 2.4759 3.0821 2.3402 2.3574 1.5155 2.7234 1.1198 2.1470 1.9019 1.8100 1.6121 1.7124 2.3748 1.9564 1.5789 1.6915 1.7223 2.9546 2.1120 1.2644 1.1498 1.1599 1.5167 1.3631 1.4170 1.2260 1.2263 1.2443 1.5604 1.1930 1.0488 1.0488 1.0926 1.0474 1.0465 1.0630 1.0866 1.0795 1.0723 1.0840 1.0375 1.0354 1.0351 1.0859 1.0976 1.0995 1.1002 1.1002 1.1001 1.0997 1.0733 1.0655
irintensity: 0.5342 1.5235 1.1645 0.3376 4.4506 1.0160 0.3049 4.3148 1.5810 50.3797 113.3409 5.8520 17.6568 26.9653 1.5057 68.8756 2.0959 4.0277 7.3125 14.7214 2.1284 29.1454 15.5137 6.0717 16.8268 23.7989 28.4385 6.2252 48.6674 54.0509 39.4814 12.4317 13.8797 8.4455 15.6082 4.0814 12.9202 30.1177 18.7303 16.5085 18.3461 6.0897 9.0816 22.6735 12.0378 9.9109 0.8232 3.8904 135.9452 124.2978 89.4806 32.6482 16.5770 16.1258 21.5080 55.7799 37.0891 35.4760 26.6502 25.7180 19.4565 4.7011 3.6559
temp: 298.150 k
press: 1.00000 atm
elementType: 8 7 6 6 6 6 6 6 1 1 1 1 1 1 1 1 1 1 1 1 1 1 1
symmnumber: 1
zpe: 539628.3 jmol-1
zpe.correction: 0.205534 hartree
zpe.thermalcorrener: 0.216330 hartree
zpe.thermalcorrenthalpy: 0.217274 hartree
zpe.thermalcorrgfe: 0.169900 hartree
zpe.sumelectzpe: -366.897808 hartree
zpe.sumelectthermal: -366.887012 hartree
zpe.sumelectthermalent: -366.886067 hartree
zpe.sumelectthermalfe: -366.933442 hartree
dipole: -1.9987 0.2654 -1.6846
dipole: 2.6274
quadrupole: -58.0566 -50.6112 -48.8106
quadrupole: 0.0489 -0.4406 0.0637
quadrupole: -5.5638 1.8816 3.6822 0.0489 -0.4406 0.0637
hfenergy: -367.1033417 hartree
pointgroup: C01 [X(C6H15N1O1)]
dipole: -0.7830004 -0.132464 0.6617297 debye
dipolederiv: -0.7740084 0.1224178 -0.2801645 0.0845652 -0.5541706 -0.0759571 -0.2921012 -0.0626031 -0.3371786 -0.8430474 0.0373151 -0.0014108 -0.0180973 -0.4597589 0.1726832 0.006107 0.2258528 -0.3184587 0.3515446 -0.1652601 -0.0094133 -0.3253111 0.2860569 -0.1023855 -0.0240167 -0.0896479 0.3490701 0.555041 -0.088852 0.1237093 -0.0785149 0.4720094 -0.037597 0.1316641 -0.0209643 0.4017089 -0.0316109 0.011448 0.0015369 0.0746188 -0.0561445 -0.104451 0.0138772 -0.0975385 -0.0511112 0.536976 0.1474056 -0.0500376 0.2752624 0.269526 -0.099779 0.0393419 -0.100434 0.3369983 -0.0324864 -0.0386226 0.0404873 -0.0026038 -0.0260135 0.1074905 -0.0078625 0.1065638 -0.1005155 -0.096067 0.0581856 -0.0084948 0.0460014 0.0332725 0.0162827 0.0158146 0.0317824 0.0873733 -0.0814322 0.0057973 0.0050301 0.087578 -0.1186821 0.1350186 -0.0882986 0.1660663 -0.2615816 -0.0524101 0.0765453 0.0440103 0.0533561 -0.1212128 -0.1093432 0.0686978 -0.1366898 -0.1560396 0.1328493 0.0145905 -0.0052017 0.0123469 0.1158194 -0.1146401 -0.0097352 -0.2206376 0.0494391 -0.0266856 -0.1647222 -0.0105246 -0.1429432 -0.0485557 -0.009626 0.010864 0.0093483 0.0604771 0.1059395 0.0107376 -0.0335125 0.0108753 0.0328132 0.1142604 -0.0168715 0.06029 -0.0839971 -0.0751737 0.1251971 0.0317266 0.0860147 0.0727604 0.0022526 -0.0013341 0.0126687 0.0924773 0.0336944 0.0011987 0.0117403 -0.0476382 -0.04051 -0.0991075 -0.0152442 -0.1183617 -0.0866341 -0.0889272 0.001616 -0.0076152 -0.1156903 -0.1185125 0.154209 0.0892782 0.1910199 -0.1433216 -0.0488268 -0.149444 -0.0032092 -0.142484 -0.030864 -0.0154402 -0.0302795 -0.0348121 0.0764608 0.0866909 0.032968 0.0549148 0.0693088 0.0008971 -0.1165021 0.0524074 -0.0767998 -0.0272212 0.0053069 0.1168967 -0.0744622 0.0959475 0.0620188 0.0300324 -0.0656895 0.0245102 0.066452 0.0780207 -0.0179066 -0.0387015 0.0416016 -0.0170676 -0.1186877 0.0038171 -0.1433224 -0.0993406 0.1097278 -0.0172276 0.0320371 0.035793 -0.012146 0.1088219 -0.0145452 0.1247308 -0.0615486 -0.1632368 -0.0743784 -0.0009042 -0.1207396 0.0307347 -0.0035846 0.0011787 -0.0047896 0.1058917 0.3181212 -0.0459062 0.1784594 0.0207528 0.2277299 0.1660497 0.1329303 0.1537677 0.1005999 unknown
polarizability: 89.8704891|-1.7730434|74.0332372|-0.3184437|-0.8815423|69.2050779 unknown
InChI: InChI=1S/C6H15NO/c1-4-7-5(2)6(3)8/h5-8H,4H2,1-3H3
charge 0 multiplicity 1
23 atoms
O  2.683926 -0.332084 0.764276
N  -0.966284 0.340309 0.123904
C  0.248979 -0.498872 0.256784
C  1.481839 0.444301 0.397299
C  0.391831 -1.482693 -0.920417
C  -2.262822 -0.374896 0.136494
C  1.84414 1.216726 -0.872153
C  -3.431765 0.625295 0.13601
H  0.215518 -1.111098 1.203718
H  1.250588 1.168063 1.216112
H  -0.96772 1.095577 0.82714
H  -0.352206 -2.296653 -0.861117
H  0.252725 -0.955643 -1.880219
H  1.398796 -1.93642 -0.902923
H  -2.324345 -1.008034 -0.767854
H  -2.359393 -1.062466 1.016168
H  2.639857 1.950556 -0.658389
H  2.216781 0.526152 -1.647455
H  0.953183 1.741644 -1.257582
H  -3.414383 1.263244 1.041198
H  -3.37249 1.284524 -0.747828
H  -4.401365 0.09624 0.117488
H  2.488707 -0.848971 1.588245
