program: Gaussian 09
title: 000235639
version: EM64L-G09RevD.01
frameworkgroup: C1[X(C7H17NO)]
method: RPBEPBE
basis: SDD
operation: Freq
keyword: #p
keyword: freq=noraman
keyword: PBEPBE/SDD
title: #p freq=noraman PBEPBE/SDD
converged: YES YES NO NO
title: Mulliken charges:
elementType: O N C C C C C C C H H H H H H H H H H H H H H H H H
charge: -0.443136 -0.384281 0.237514 -0.331584 -0.323174 -0.714451 -0.716845 -0.383031 -0.679059 0.251474 0.172113 0.200828 0.177845 0.220999 0.219882 0.206164 0.218040 0.219592 0.213180 0.243847 0.217087 0.186363 0.208368 0.211651 0.221769 0.348845
chargesum: 0.00000
title: Mulliken charges with hydrogens summed into heavy atoms:
elementType: O N C C C C C C C
charge: -0.094291 -0.132807 0.237514 0.041357 0.075670 -0.070365 -0.040225 0.020419 -0.037271
polarizability: 1.02847372e+02 -1.20208471e+00 8.27206796e+01 7.64241385e-01 -5.84745659e-01 7.89873234e+01
1716.lowfreq: -14.0771 -8.0679 -0.0009 0.0001 0.0003 9.4950 56.4485 59.8556 106.8763
frequency: 56.4287 59.6882 106.8043 130.2195 157.8197 194.8305 212.6108 217.3173 258.0846 291.6810 315.8469 341.9095 365.7117 446.4039 470.1061 549.8971 644.9249 730.8437 758.8773 804.2804 869.2955 891.4431 900.6486 922.2778 925.9605 978.7463 1003.0746 1017.0377 1051.6932 1094.0727 1115.3503 1131.2210 1150.1487 1191.0711 1227.7318 1232.4097 1261.3743 1285.3063 1304.1915 1310.6227 1363.4812 1371.1053 1385.5892 1391.7007 1401.6299 1448.4693 1460.2785 1464.5748 1472.1235 1478.2434 1479.0928 1482.5132 1485.9826 1486.6928 1497.0245 2883.2159 2907.2250 2965.3200 2967.7454 2977.5509 2989.0603 3022.3745 3041.2475 3053.1785 3060.6659 3067.8619 3073.8816 3079.3630 3085.4835 3094.6126 3284.2224 3381.4500
redmass: 2.8280 1.7068 2.9579 2.4380 2.4085 1.1516 2.1333 1.2795 1.2272 2.4244 2.2058 2.4763 2.5115 2.3205 2.7921 3.1187 1.2831 2.4762 1.0860 1.5925 1.9398 1.2500 1.8002 1.4584 1.4331 1.7309 2.7212 1.5562 3.1101 2.3916 2.4237 1.7491 1.2757 2.5711 2.1862 1.4830 1.9231 1.1143 1.2663 1.4353 1.4685 1.2178 1.2272 1.2115 1.2094 1.1671 1.0510 1.0879 1.0644 1.0469 1.0652 1.0636 1.0659 1.1077 1.0820 1.0707 1.0705 1.0355 1.0632 1.0362 1.0356 1.0892 1.0965 1.0933 1.0978 1.0995 1.1007 1.0993 1.0987 1.1002 1.0632 1.0729
irintensity: 1.0419 0.8065 3.7537 2.6807 3.5165 0.4884 1.5535 0.3307 0.6047 0.8311 1.4696 1.0158 6.6449 2.8681 1.4584 2.0009 47.2489 78.6974 6.9576 111.1915 2.5848 5.2244 4.1205 1.6088 2.9459 8.5303 65.5363 15.8599 1.3961 7.0644 12.2931 25.1146 29.4486 31.4755 12.2631 27.4524 15.4623 5.2184 15.9273 15.8175 1.7301 26.3784 24.0922 15.6685 51.5703 23.0280 1.4564 1.1059 2.7112 15.7414 15.2815 0.7417 19.9678 3.5725 11.0371 76.8990 94.5993 32.4812 36.4715 32.8540 17.7324 10.9846 22.8104 13.6646 58.6628 24.3893 77.9345 48.4207 53.8423 20.3583 106.3982 2.4476
temp: 298.150 k
press: 1.00000 atm
elementType: 8 7 6 6 6 6 6 6 6 1 1 1 1 1 1 1 1 1 1 1 1 1 1 1 1 1
symmnumber: 1
zpe: 613570.2 jmol-1
zpe.correction: 0.233697 hartree
zpe.thermalcorrener: 0.245660 hartree
zpe.thermalcorrenthalpy: 0.246604 hartree
zpe.thermalcorrgfe: 0.196171 hartree
zpe.sumelectzpe: -406.124747 hartree
zpe.sumelectthermal: -406.112783 hartree
zpe.sumelectthermalent: -406.111839 hartree
zpe.sumelectthermalfe: -406.162272 hartree
dipole: 2.1305 2.8587 -0.9467
dipole: 3.6888
quadrupole: -60.2103 -64.7890 -56.6194
quadrupole: -7.7977 0.9942 1.0263
quadrupole: 0.3293 -4.2494 3.9202 -7.7977 0.9942 1.0263
hfenergy: -406.3584431 hartree
pointgroup: C01 [X(C7H17N1O1)]
dipole: 0.9391508 1.0496289 -0.350015 debye
dipolederiv: -0.5089909 -0.1112779 -0.0606393 -0.0326768 -0.8019583 0.0590575 -0.0927972 -0.0041773 -0.5307962 -0.8532085 0.0069267 -0.0691431 -0.0401966 -0.6346039 0.0161362 -0.0123823 0.002979 -0.1711691 0.4514914 -0.1925258 -0.0435326 -0.1259371 0.3225732 -0.0659821 -0.1887188 -0.0251246 0.2012361 0.2281181 -0.0205575 0.0436643 -0.0987333 0.4268945 -0.1061823 0.0745972 -0.0471757 0.4105984 0.4630618 0.1114897 0.0840777 0.1200102 0.2679258 -0.0568421 0.2260068 -0.0502458 0.2180874 -0.0337078 -0.0122235 0.0154953 0.0711009 -0.1493633 0.0778701 -0.0005186 0.0853904 -0.001821 0.0182668 0.0041406 -0.0073126 0.0414937 -0.0081189 -0.0156608 0.0272758 0.005105 -0.1243567 -0.001243 0.0104195 -0.0284733 -0.0169424 0.1071326 -0.0383432 -0.0240178 -0.0217445 0.1580058 -0.0620624 -0.0003208 -0.0316809 0.0287644 0.0757145 -0.018398 -0.0016827 -0.0256863 0.0699198 0.1128914 0.0281267 0.0280975 -0.0110043 0.2657177 0.0556247 0.0111126 -0.0296541 -0.059931 0.0478233 -0.0067538 0.0136767 0.0006748 -0.0217252 0.0272023 -0.0661567 0.0426742 -0.2841075 -0.123917 0.0900793 0.0357117 0.0835164 0.016446 -0.0066832 0.0999772 -0.0261358 0.046047 -0.0843855 -0.0663198 -0.013916 -0.1344686 -0.2339883 0.0014163 -0.0205696 0.0363761 0.0337857 0.0463873 -0.0086601 0.0072499 -0.0277446 0.0495119 0.0205974 -0.0224764 -0.0003084 -0.1542211 -0.1143144 0.1416312 0.0287604 0.1139242 0.013176 -0.0007903 0.0524472 -0.023456 0.079209 0.0929172 0.0087963 0.0136863 0.0001461 0.0599652 -0.0739343 0.0085182 -0.0033353 -0.1800687 -0.0494399 -0.1538559 -0.0327476 -0.1112607 -0.0154381 -0.0141579 -0.0553982 -0.0370215 0.0653759 -0.0487224 -0.1246826 -0.082128 -0.1279274 0.00867 -0.0481177 -0.0518219 -0.0328989 0.03683 -0.1157347 0.1133598 0.0685034 0.1007031 0.0415628 -0.0406892 0.0165193 -0.0127536 0.0809219 0.1099938 0.0212587 -0.0168665 0.0181423 -0.0426506 0.1344813 -0.011073 0.0783809 0.0239349 0.0333927 -0.075994 0.0051784 -0.0323313 -0.1529809 0.0174395 0.006585 0.0430837 0.0680003 0.0248781 0.0059784 -0.0363059 0.0183518 0.0668028 0.0365795 -0.0065765 -0.0054375 -0.2105962 0.0650431 -0.0309437 -0.0093968 -0.1026673 -0.1564598 0.0430496 -0.0047266 0.0590991 0.0715495 0.075918 -0.0154617 0.0262115 -0.0218569 0.0884318 0.022837 -0.0435805 0.021858 -0.1786198 -0.1211216 0.1071671 0.0503277 0.13283 0.0097664 -0.0556243 0.0734619 -0.0613065 0.0634477 0.3466653 0.1702031 0.0115019 0.1540894 0.396996 0.0291139 0.0059955 0.0315154 0.268738 unknown
polarizability: 102.4543344|-2.9011312|83.0810558|1.1686862|-0.6916474|79.0199844 unknown
InChI: InChI=1S/C7H17NO/c1-4-5-8-7(2,3)6-9/h8-9H,4-6H2,1-3H3
charge 0 multiplicity 1
26 atoms
O  -2.071308 -1.725849 0.076798
N  0.131629 -0.240042 -0.380903
C  -1.107817 0.551894 -0.047618
C  -2.277344 -0.391329 -0.474193
C  1.432185 0.168383 0.206121
C  -1.187366 1.887451 -0.829912
C  -1.180228 0.806017 1.474842
C  2.570952 -0.711112 -0.350059
C  3.946128 -0.335402 0.241885
H  0.220594 -0.313755 -1.408123
H  -2.332044 -0.425047 -1.587888
H  -3.242192 -0.019017 -0.08746
H  1.676852 1.24154 0.013772
H  1.38206 0.04049 1.302594
H  -2.127731 2.42511 -0.60475
H  -1.153698 1.710147 -1.922516
H  -0.346411 2.554062 -0.563271
H  -0.357039 1.45288 1.825836
H  -2.131494 1.311901 1.7184
H  -1.151693 -0.149506 2.027061
H  2.336106 -1.770894 -0.13333
H  2.605162 -0.613286 -1.455575
H  4.208219 0.714561 0.012068
H  3.949951 -0.450343 1.341932
H  4.745162 -0.979748 -0.166465
H  -1.06903 -1.825204 0.043358
