program: Gaussian 09
title: 000235633
version: EM64L-G09RevD.01
frameworkgroup: C1[X(C24H22N2O4S2)]
method: RPBEPBE
basis: SDD
operation: Freq
keyword: #p
keyword: freq=noraman
keyword: PBEPBE/SDD
title: #p freq=noraman PBEPBE/SDD
converged: YES YES NO NO
title: Mulliken charges:
elementType: S S O O O O N N C C C C C C C C C C C C C C C C C C C C C C C C H H H H H H H H H H H H H H H H H H H H H H
charge: 0.890431 0.890391 -0.539541 -0.530537 -0.539480 -0.530590 -0.237468 -0.237443 -0.440125 -0.420463 -0.440296 -0.420579 -0.025075 -0.024748 -0.393305 -0.393557 -0.297981 -0.297769 0.377291 0.377336 0.386624 0.386639 -0.396725 -0.396761 -0.403124 -0.403115 -0.399711 -0.399709 -0.234302 -0.234287 -0.231247 -0.231256 0.285167 0.277016 0.297811 0.243291 0.285141 0.277085 0.297793 0.243307 0.281999 0.281963 0.297267 0.297169 0.249462 0.249449 0.248583 0.248570 0.244279 0.244272 0.236064 0.236058 0.234367 0.234368
chargesum: 0.00000
title: Mulliken charges with hydrogens summed into heavy atoms:
elementType: S S O O O O N N C C C C C C C C C C C C C C C C C C C C C C C C
charge: 0.890431 0.890391 -0.539541 -0.530537 -0.539480 -0.530590 -0.237468 -0.237443 0.122058 0.120639 0.121930 0.120521 -0.025075 -0.024748 -0.111306 -0.111594 -0.000714 -0.000599 0.377291 0.377336 0.386624 0.386639 -0.147262 -0.147312 -0.154540 -0.154545 -0.155432 -0.155437 0.001762 0.001771 0.003120 0.003112
polarizability: 5.45738801e+02 4.05092934e-01 3.05767040e+02 7.24230242e+01 -1.27638232e-01 2.56357284e+02
1716.lowfreq: -3.0224 -1.5023 0.0011 0.0019 0.0026 9.6651 10.3682 12.1395 19.8294
frequency: 9.7495 10.2610 19.7638 25.2193 30.7853 33.7160 71.7445 75.9689 87.4554 103.2447 107.6431 135.5236 144.9968 184.4924 185.3519 198.6107 205.7533 213.3727 215.9379 245.1245 250.4730 252.3916 257.0800 274.8447 278.8481 321.0432 347.9887 359.3183 380.0402 387.7581 395.8582 405.7636 408.5511 412.1756 427.3116 444.2649 455.3052 477.1799 477.3379 496.2692 508.3924 508.6240 515.5542 521.7328 536.5366 575.2190 584.3934 626.0649 627.0977 639.9448 640.3769 647.2994 753.9101 753.9600 759.0725 759.1246 771.9156 779.1892 780.0584 782.5462 783.2181 792.5235 818.3241 820.6285 821.2266 838.2453 838.4325 875.7968 877.1244 879.0844 913.8809 914.0437 917.2838 917.3432 926.5189 926.6681 968.5565 968.6361 985.4873 988.5672 989.1141 997.5793 999.2732 999.2877 1008.5383 1022.9580 1022.9748 1056.4946 1056.7793 1087.6941 1111.8190 1118.2034 1130.0890 1130.3835 1150.4753 1150.8412 1176.3699 1176.3857 1195.7804 1224.7469 1224.7983 1242.5965 1242.7070 1251.9777 1259.2843 1272.4323 1272.4747 1304.2554 1320.2967 1328.0030 1336.0636 1343.6023 1343.6442 1365.3526 1409.2819 1409.2912 1426.2775 1426.3334 1427.0452 1429.8078 1433.5439 1433.5597 1439.0685 1440.8360 1445.1085 1445.2095 1512.1641 1512.2073 1580.7913 1580.8730 1593.7329 1593.7507 1632.4207 1632.4526 2989.5186 2992.4860 2993.2219 2997.6399 3059.6766 3066.3513 3067.2846 3072.1734 3127.6837 3127.7029 3134.2553 3134.3249 3137.5819 3137.6331 3149.5585 3149.5996 3151.9606 3152.0556 3164.8551 3164.8756 3167.6019 3167.6551
redmass: 5.8348 6.0942 4.8702 5.4028 7.1676 4.3369 5.8132 6.3039 6.1598 9.5726 6.8616 5.9502 7.0721 3.8291 3.7204 8.1411 6.7756 9.3722 7.6797 7.1148 4.8602 4.6323 6.6173 5.8035 3.7011 4.4888 3.1354 3.3938 4.2293 3.9680 4.8064 4.3773 3.5062 4.2848 2.8357 5.2235 5.8813 2.4874 2.5007 4.0648 6.7987 6.8103 4.2058 4.1428 7.0296 7.1899 7.9820 6.3885 6.6743 3.4125 3.4632 2.1295 4.7413 4.7419 1.2665 1.2634 5.4355 3.5796 3.0107 4.1392 6.1149 1.8109 3.4402 6.8353 6.8536 1.3051 1.3029 1.8985 1.4630 2.1533 1.7894 1.7903 12.3186 13.0167 5.9848 5.9862 1.3692 1.3695 1.8868 1.3567 1.4091 2.6952 1.3561 1.3566 2.3691 2.3725 2.3719 2.3249 2.3283 2.1896 3.8692 5.7927 1.6647 1.6722 1.2298 1.2300 1.0774 1.0774 1.1713 2.0080 2.0092 1.4074 1.4068 1.1691 1.2197 1.8338 1.8337 1.1508 1.1686 1.3148 1.2516 1.7953 1.7936 1.2582 4.7750 4.7740 6.6262 6.6479 1.0763 1.0889 2.2787 2.2953 1.0811 1.0851 2.3073 2.2775 3.8233 3.8217 6.5786 6.5744 6.7457 6.7460 6.6701 6.6718 1.0638 1.0652 1.0585 1.0610 1.0998 1.1046 1.0974 1.1026 1.0863 1.0863 1.0890 1.0890 1.0889 1.0889 1.0954 1.0954 1.0926 1.0926 1.0962 1.0962 1.1005 1.1005
irintensity: 0.7692 0.7661 0.2873 0.2604 0.7403 0.7201 2.1219 3.0791 0.6205 2.2141 1.6082 0.6297 0.0024 0.7768 0.1404 14.8125 1.0421 34.3532 1.9663 62.4260 0.4508 4.0623 0.8206 13.6290 0.2224 5.0459 2.9220 0.9205 0.0070 11.8070 15.9416 71.0392 0.1003 18.8686 2.6290 1.7924 168.8716 13.5382 60.4124 37.5763 0.1194 2.0496 1.7056 31.6154 1.3266 31.7931 4.6305 6.4826 1.2092 14.6593 0.0800 346.4914 1.0536 1.7988 17.9327 65.6067 6.2092 55.6000 2.2559 65.9821 7.2120 10.8381 66.9498 7.0638 31.0742 47.7614 18.9929 8.3991 70.5270 7.7854 2.8722 2.0172 96.0483 30.1810 14.3172 14.8145 5.4611 4.1420 1.4467 2.1309 0.1338 0.6091 0.1484 0.0227 16.1669 14.2290 0.3671 55.0787 7.9789 0.3771 0.2191 13.0815 18.4077 18.7662 12.5941 1.7883 1.5003 0.5282 11.1375 8.3797 5.3035 4.4154 0.0938 22.1541 52.7963 8.1050 9.7374 3.2317 0.0162 0.7278 3.0255 5.9093 15.6854 18.1517 6.2995 3.7213 1.3897 1.1002 51.3231 10.5058 1.2123 1.3032 7.5673 34.0991 1.2245 0.5277 29.9756 1.9316 5.4395 7.8201 3.2512 2.2282 0.7703 0.9308 8.1676 0.6098 41.3823 10.9682 16.0671 1.1611 3.8395 0.6593 1.4661 1.6169 0.0760 0.0748 7.3039 7.3559 22.6090 27.0817 0.0170 0.0111 13.4075 6.7445 62.3165 11.2537
temp: 298.150 k
press: 1.00000 atm
elementType: 16 16 8 8 8 8 7 7 6 6 6 6 6 6 6 6 6 6 6 6 6 6 6 6 6 6 6 6 6 6 6 6 1 1 1 1 1 1 1 1 1 1 1 1 1 1 1 1 1 1 1 1 1 1
symmnumber: 1
zpe: 1068742.8 jmol-1
zpe.correction: 0.407063 hartree
zpe.thermalcorrener: 0.435846 hartree
zpe.thermalcorrenthalpy: 0.436791 hartree
zpe.thermalcorrgfe: 0.343705 hartree
zpe.sumelectzpe: -2131.671847 hartree
zpe.sumelectthermal: -2131.643064 hartree
zpe.sumelectthermalent: -2131.642119 hartree
zpe.sumelectthermalfe: -2131.735205 hartree
dipole: -0.0038 5.6921 -0.0123
dipole: 5.6921
quadrupole: -134.5538 -193.9038 -221.7670
quadrupole: 0.1520 27.2054 -0.1156
quadrupole: 48.8544 -10.4956 -38.3588 0.1520 27.2054 -0.1156
hfenergy: -2132.0789101 hartree
pointgroup: C01 [X(C24H22N2O4S2)]
dipole: -0.0009792 0.0037995 2.2394598 debye
polarizability: 544.5040047|-74.8395718|257.592117|0.3221492|0.1171886|305.7670027 unknown
InChI: InChI=1S/C24H22N2O4S2/c27-31(28,23-11-9-19-5-1-3-7-21(19)17-23)25-13-15-26(16-14-25)32(29,30)24-12-10-20-6-2-4-8-22(20)18-24/h1-12,17-18H,13-16H2
charge 0 multiplicity 1
54 atoms
S  2.448349 1.35055 -1.225323
S  -2.447085 -1.35454 -1.213708
O  1.711717 2.547828 -0.372494
O  2.849565 1.573378 -2.790649
O  -1.710185 -2.54689 -0.354284
O  -2.848493 -1.585415 -2.777895
N  1.464474 -0.313998 -1.204637
N  -1.462693 0.309903 -1.201195
C  0.647707 -0.425498 -2.450227
C  0.650656 -0.427981 0.042627
C  -0.649668 0.417441 -2.44957
C  -0.645123 0.427629 0.043288
C  3.972302 0.851428 -0.234056
C  -3.971607 -0.850921 -0.225655
C  4.88024 -0.025177 -0.809596
C  -4.881968 0.018759 -0.807809
C  4.130827 1.440665 1.049003
C  -4.127902 -1.429928 1.062316
C  6.051928 -0.378975 -0.063358
C  -6.053977 0.375999 -0.06371
C  6.247545 0.193287 1.256471
C  -6.247251 -0.185613 1.261024
C  5.270416 1.103408 1.781854
C  -5.267692 -1.08915 1.793213
C  7.033197 -1.283556 -0.58886
C  -7.037814 1.273778 -0.596052
C  7.421887 -0.165321 1.997248
C  -7.421851 0.17647 1.999696
C  8.165156 -1.612828 0.158744
C  -8.16998 1.606642 0.149648
C  8.360471 -1.04937 1.46108
C  -8.362938 1.053756 1.456853
H  1.288093 -0.138274 -3.30255
H  0.407886 -1.502994 -2.547114
H  0.386143 -1.500128 0.123284
H  1.282803 -0.163455 0.909484
H  -1.292511 0.127468 -3.299093
H  -0.410223 1.494651 -2.550462
H  -0.380442 1.500048 0.119798
H  -1.274584 0.165671 0.912856
H  4.713541 -0.435197 -1.811288
H  -4.71707 0.420585 -1.813118
H  3.380812 2.148308 1.415924
H  -3.376257 -2.133126 1.434407
H  5.43022 1.539875 2.774269
H  -5.425812 -1.517746 2.789322
H  6.881324 -1.71216 -1.586036
H  -6.887746 1.694299 -1.596938
H  7.573296 0.265625 2.993829
H  -7.571448 -0.246414 2.999994
H  8.910875 -2.304231 -0.247646
H  -8.917666 2.292797 -0.261989
H  9.254073 -1.316972 2.035186
H  -9.256713 1.324111 2.029396
