program: Gaussian 09
title: 000235627
version: EM64L-G09RevD.01
frameworkgroup: C1[X(C7H4ClN3O5)]
method: RPBEPBE
basis: SDD
operation: Freq
keyword: #p
keyword: freq=noraman
keyword: PBEPBE/SDD
title: #p freq=noraman PBEPBE/SDD
converged: YES YES NO NO
title: Mulliken charges:
elementType: Cl O O O O O N N N C C C C C C C H H H H
charge: 0.051900 -0.251826 -0.165330 -0.157702 -0.174164 -0.183056 -0.003706 0.020366 -0.614437 0.454046 0.596812 0.459321 -0.551282 -0.524762 -0.493545 0.174107 0.343412 0.333493 0.333597 0.352757
chargesum: 0.00000
title: Mulliken charges with hydrogens summed into heavy atoms:
elementType: Cl O O O O O N N N C C C C C C C
charge: 0.051900 -0.251826 -0.165330 -0.157702 -0.174164 -0.183056 -0.003706 0.020366 0.071917 0.454046 0.596812 0.459321 -0.551282 -0.181350 -0.160052 0.174107
polarizability: 1.79087000e+02 -2.29213794e-01 1.61722461e+02 7.90155666e+00 1.78030181e+00 5.75585882e+01
1716.lowfreq: -6.3240 -1.6231 -0.0021 -0.0020 -0.0017 4.2467 33.1511 45.5546 51.3411
frequency: 33.0987 45.5540 51.3403 56.7701 108.6440 142.2550 169.5099 173.4024 236.9148 275.6402 290.9367 308.5016 314.7420 348.4255 403.8214 445.4184 496.1826 514.3478 545.9151 552.3036 591.0926 623.3726 636.3037 677.6953 690.3113 713.7661 727.5213 735.7997 778.4948 844.8175 879.4277 951.0919 985.3574 1021.3909 1072.9232 1104.5734 1159.9029 1186.4642 1206.9695 1220.1772 1339.7628 1372.8809 1381.9671 1384.3743 1409.8250 1426.8736 1568.9815 1587.2973 1602.5537 1640.8874 3172.5424 3187.8322 3509.1696 3660.1004
redmass: 6.3699 15.5569 15.4308 14.4826 10.2277 13.1326 10.2399 5.4600 16.6460 9.0644 15.3909 6.8045 13.1781 6.1844 6.9597 4.4532 3.9069 7.7131 1.3870 5.2338 3.1416 2.4281 2.8448 4.5894 10.4478 5.2776 10.9874 6.1380 5.9747 8.4722 10.9090 1.5069 1.4969 7.5092 1.8274 1.5116 9.0349 1.5284 10.5840 11.4364 3.7052 8.0671 8.4689 7.6965 6.4327 5.0543 4.2256 3.3048 4.9422 2.1567 1.0920 1.0933 1.0456 1.1045
irintensity: 11.5722 0.0976 0.0980 1.0917 6.0019 0.5206 4.5887 3.4462 2.3651 3.8571 0.1969 9.7929 0.7078 1.3303 3.8897 5.8128 10.3468 3.2782 58.7975 22.0427 25.3663 122.3498 61.4234 54.1128 16.9011 8.6861 10.4267 5.8579 12.0462 7.2127 36.3380 17.4045 23.2622 51.2632 3.2017 20.6540 0.1681 6.7118 276.5290 184.3464 61.0821 19.8401 158.8655 122.4010 53.2150 39.4341 43.6550 74.2317 8.2422 288.2412 25.9714 21.2007 42.8889 73.9124
temp: 298.150 k
press: 1.00000 atm
elementType: 17 8 8 8 8 8 7 7 7 6 6 6 6 6 6 6 1 1 1 1
symmnumber: 1
zpe: 308434.5 jmol-1
zpe.correction: 0.117477 hartree
zpe.thermalcorrener: 0.131732 hartree
zpe.thermalcorrenthalpy: 0.132677 hartree
zpe.thermalcorrgfe: 0.074104 hartree
zpe.sumelectzpe: -1268.260902 hartree
zpe.sumelectthermal: -1268.246647 hartree
zpe.sumelectthermalent: -1268.245702 hartree
zpe.sumelectthermalfe: -1268.304275 hartree
dipole: 4.5297 1.7676 1.3443
dipole: 5.0448
quadrupole: -104.5728 -114.6862 -97.3320
quadrupole: 15.0050 0.7804 4.0484
quadrupole: 0.9575 -9.1559 8.1983 15.0050 0.7804 4.0484
hfenergy: -1268.378379 hartree
pointgroup: C01 [X(C7H4Cl1N3O5)]
dipole: 1.7835074 0.4119291 0.767269 debye
dipolederiv: -0.6572222 0.1268189 -0.0237072 0.0926783 -0.0546922 -0.0277295 -0.0333795 -0.0370767 0.0131732 -0.6049034 -0.1146125 -0.1373904 0.0925307 -0.912549 0.2166646 -0.1592311 0.0734117 -0.4678539 -0.2978022 -0.0386906 -0.2025995 -0.0808425 -0.6984966 -0.1857211 -0.1646563 -0.0829307 -0.4553362 -0.3556775 0.1162503 -0.2569908 0.1518466 -0.5588439 0.0963561 -0.212556 -0.0061163 -0.4766426 -0.6225815 0.1885714 -0.0460344 0.1313417 -0.6659664 0.013974 -0.0463193 0.0130834 -0.2061789 -0.7567773 -0.1541663 -0.0577979 -0.1111171 -0.5593093 -0.0082344 -0.0605972 -0.017392 -0.2154645 0.4261041 -0.2219507 0.5354073 -0.142351 1.4447512 0.1013486 0.3965092 0.094648 0.7949656 1.6915441 -0.1348719 0.1572746 -0.1340224 1.04342 -0.0147267 0.1830213 0.0000274 0.2011951 -1.0030989 -0.0623262 -0.2024334 -0.1258374 -0.4153681 -0.1275447 -0.2173887 -0.1036784 -0.742004 -0.4166228 0.1147364 -0.0552916 0.0750874 -0.3937562 0.0176571 -0.0244949 0.0800731 0.0667881 -0.3455092 0.0293924 -0.0934649 0.0136163 -0.2878651 -0.0136687 -0.0827925 -0.0473708 0.0429455 -0.4518712 0.0750075 -0.0469911 0.0842549 -0.0890946 -0.0003848 -0.0574081 -0.0066061 0.0721867 1.0323919 -0.131768 0.0020916 -0.2024697 0.323917 0.0088059 -0.0010761 0.0561616 -0.0832491 0.1876187 -0.0944801 0.0198004 0.134683 -0.0859672 0.0237415 0.0469787 -0.0009153 -0.0579007 0.0975078 -0.086513 0.0044176 -0.2641556 -0.0353314 -0.007979 0.0452801 -0.0771094 -0.0524579 1.2329199 0.3551146 0.503442 0.1566925 1.1719804 -0.218014 0.470566 -0.0864612 0.5345529 0.1820585 0.0281513 0.0066495 0.0298013 0.1805965 -0.0022273 -0.0202864 -0.0005603 0.1655835 0.1633407 -0.0185936 0.0104788 0.006336 0.1381034 -0.0029759 -0.0220766 0.0135576 0.1725878 0.2444784 0.0204112 -0.0580709 0.0623203 0.2635816 0.074022 0.0037881 0.0792536 0.3495612 0.254102 0.0035191 -0.0587899 0.0296066 0.19089 0.0566362 -0.0438805 0.0560005 0.3435481 unknown
polarizability: 174.3223805|-2.7027301|162.2231115|23.7370646|-1.1062085|61.8225569 unknown
InChI: InChI=1S/C7H4ClN3O5/c8-6-4(7(9)12)1-3(10(13)14)2-5(6)11(15)16/h1-2H,9H2
charge 0 multiplicity 1
20 atoms
Cl 2.888515 -0.660792 0.288992
O  1.087074 3.477427 -0.270767
O  -0.052969 -3.504135 -0.611945
O  1.37917 -3.073691 1.11687
O  -3.395239 1.889161 -0.280676
O  -3.857823 -0.347024 -0.330107
N  0.541562 -2.712249 0.212283
N  -3.04704 0.651175 -0.240788
N  2.783184 2.37039 0.840742
C  0.707513 1.134391 0.169662
C  0.17237 -1.267539 0.132381
C  -1.597992 0.344584 -0.078237
C  1.129279 -0.221605 0.224238
C  -0.67722 1.39761 0.01809
C  -1.195517 -1.000343 -0.034825
C  1.559727 2.406697 0.215905
H  -1.002044 2.440373 -0.049772
H  -1.921311 -1.811871 -0.133128
H  3.193923 1.521727 1.227023
H  3.309139 3.244114 0.878053
