program: Gaussian 09
title: 000235623
version: EM64L-G09RevD.01
frameworkgroup: C1[X(C26H20N2)]
method: RPBEPBE
basis: SDD
operation: Freq
keyword: #pfreq=noraman
keyword: PBEPBE/SDD
title: #p freq=noraman PBEPBE/SDD
converged: YES YES NO NO
title: Mulliken charges:
elementType: N N C C C C C C C C C C C C C C C C C C C C C C C C C C H H H H H H H H H H H H H H H H H H H H
charge: -0.528589 -0.539911 0.495510 0.466564 0.394771 0.406973 0.384020 0.378673 0.507382 0.485851 -0.556594 -0.578702 -0.530514 -0.485235 -0.479850 -0.418219 -0.410424 -0.502445 -0.502544 -0.425303 -0.432237 -0.417411 -0.416013 -0.172277 -0.251458 -0.250535 -0.250650 -0.250185 0.243208 0.267518 0.300374 0.298855 0.289830 0.220795 0.228683 0.235079 0.235627 0.224260 0.234351 0.254374 0.241793 0.236360 0.237376 0.223039 0.226950 0.228625 0.225583 0.226672
chargesum: 0.00000
title: Mulliken charges with hydrogens summed into heavy atoms:
elementType: N N C C C C C C C C C C C C C C C C C C C C C C C C C C
charge: -0.228215 -0.241056 0.495510 0.466564 0.394771 0.406973 0.384020 0.378673 0.507382 0.485851 -0.313386 -0.311184 -0.240684 -0.264440 -0.251167 -0.183140 -0.174797 -0.278185 -0.268192 -0.170929 -0.190444 -0.181052 -0.178637 0.050762 -0.024508 -0.021910 -0.025067 -0.023513
polarizability: 3.52352813e+02 -2.34058892e+00 4.86533589e+02 -1.94459909e+01 -3.92918926e+00 1.56251188e+02
1716.lowfreq: -0.6154 -0.0005 0.0005 0.0005 3.8984 6.1599 22.3642 25.0843 31.9037
frequency: 22.3221 25.0416 31.8825 48.5599 55.8129 67.9479 113.4266 130.7744 179.1087 186.0233 187.3126 208.9049 241.7464 261.2602 266.9700 296.6893 305.2900 324.9929 391.0734 400.4682 400.9988 404.3287 443.2255 471.7959 475.1944 476.5007 504.7655 508.0317 511.7330 521.1534 532.2297 537.2393 550.9920 589.0063 600.9076 613.9659 635.4128 644.2258 649.4555 654.2460 680.9148 711.3438 740.4369 755.5919 757.2571 760.1481 761.2357 772.4692 782.4075 784.1586 802.6985 816.8042 820.4116 849.0642 849.5806 859.8630 880.5231 894.9928 908.8114 912.8709 924.2833 948.9380 950.4256 954.8414 955.4782 957.7581 967.2108 969.2214 980.3204 986.6354 989.2340 992.7339 1023.0302 1024.7426 1096.4004 1123.4297 1126.1204 1157.3336 1161.9614 1170.7895 1171.9804 1174.6904 1177.7453 1196.9312 1216.4238 1237.3162 1242.5918 1259.7176 1264.1625 1275.9314 1279.9378 1290.4626 1303.7867 1357.1008 1363.0753 1385.0265 1413.3076 1414.7033 1418.8208 1419.7611 1437.1716 1442.3330 1461.6111 1467.3310 1475.5804 1482.2473 1501.0099 1507.2524 1528.7089 1539.7604 1582.9738 1585.6822 1601.7931 1608.3147 1612.1774 1620.5669 1642.3059 1644.2391 3106.5245 3113.5983 3113.9811 3117.3824 3118.0742 3120.6769 3124.2448 3131.4595 3137.6307 3138.5868 3139.5902 3140.7920 3145.0789 3156.3560 3159.9496 3160.4499 3172.3454 3195.1769 3532.8806 3545.0099
redmass: 5.3973 4.9674 4.8888 4.6097 4.6483 5.5775 5.2287 4.8448 4.1793 3.7116 4.5986 4.0704 4.6572 5.3942 6.4275 4.2179 3.9725 3.9502 4.1353 3.0444 3.1225 3.3045 2.4188 1.6677 2.4466 2.5253 5.3133 6.3396 5.8410 5.7582 2.3822 4.0245 1.6844 3.9399 6.1794 5.7573 5.4583 4.2310 3.2228 3.5113 2.1861 3.0796 4.3932 1.3705 1.4344 4.1365 4.1025 1.9532 2.6387 2.9246 4.0301 1.4372 1.4374 1.5374 1.4840 1.4238 1.6683 1.8669 2.9600 3.9317 1.8463 1.3611 1.3537 3.5988 1.3646 3.4483 1.4201 1.4132 4.6158 1.3457 1.3337 2.9672 2.2311 2.2383 1.6551 1.7071 1.6913 1.3882 1.3169 1.1262 1.0912 1.4100 1.0949 1.5401 1.7189 2.2903 1.6665 1.7963 1.6616 1.8137 1.8614 1.8265 1.6557 1.8009 1.9130 3.3301 4.0516 4.5159 2.7902 3.2879 6.0862 4.5457 3.3121 2.4521 2.4690 3.4140 2.5259 3.0756 2.7817 2.3861 6.5636 6.4885 4.2506 4.9241 5.0381 5.3463 6.8074 6.3795 1.0871 1.0866 1.0865 1.0860 1.0870 1.0884 1.0883 1.0906 1.0965 1.0951 1.0957 1.0949 1.0918 1.0992 1.1002 1.1001 1.0911 1.0905 1.0750 1.0755
irintensity: 0.1128 0.2060 0.2501 1.1704 0.3382 0.1514 1.5835 2.4060 2.5309 1.0849 3.0811 5.7372 7.5986 1.1872 2.0332 7.9920 3.6424 6.3023 0.4099 5.7916 4.4979 18.5509 67.9539 52.0728 35.0112 32.4736 12.8204 1.6696 3.3802 4.7792 17.7695 1.4156 49.9265 1.9084 3.8467 1.9977 1.2310 0.7743 1.8882 7.6586 29.8810 20.7129 2.8235 46.1352 28.9757 2.6214 4.3380 45.2988 0.6467 4.3703 20.2547 60.0814 40.0798 106.6055 14.2564 21.8210 6.0493 3.5617 1.9049 1.1785 1.9037 1.6572 1.8075 2.5665 1.2620 4.9659 6.1544 5.0886 4.2006 0.0226 0.2762 19.9968 2.4470 8.5150 6.7638 8.2066 3.1397 1.6886 11.7675 0.7287 6.6681 2.4939 24.9900 27.7182 41.9121 21.9770 7.6374 3.3149 34.0922 3.8678 1.2433 25.0247 51.7538 36.6179 63.8496 1.0755 15.0622 20.7883 56.2555 5.8641 1.3020 10.9453 50.0930 21.6368 63.5907 194.5682 107.3595 72.8004 275.6655 282.2016 13.9960 42.3461 350.2894 92.3930 13.3319 173.4726 26.1410 178.2559 10.2568 6.1962 11.8682 5.0242 6.0755 1.8105 2.5939 19.4760 22.8883 3.5753 76.3850 19.0158 9.9963 36.2985 12.9740 54.4473 8.7215 0.8566 18.8473 25.6490
temp: 298.150 k
press: 1.00000 atm
elementType: 7 7 6 6 6 6 6 6 6 6 6 6 6 6 6 6 6 6 6 6 6 6 6 6 6 6 6 6 1 1 1 1 1 1 1 1 1 1 1 1 1 1 1 1 1 1 1 1
symmnumber: 1
zpe: 1006106.1 jmol-1
zpe.correction: 0.383206 hartree
zpe.thermalcorrener: 0.404824 hartree
zpe.thermalcorrenthalpy: 0.405768 hartree
zpe.thermalcorrgfe: 0.331356 hartree
zpe.sumelectzpe: -1110.420549 hartree
zpe.sumelectthermal: -1110.398931 hartree
zpe.sumelectthermalent: -1110.397987 hartree
zpe.sumelectthermalfe: -1110.472398 hartree
dipole: 0.0163 2.0218 -0.5313
dipole: 2.0905
quadrupole: -140.7487 -139.3038 -168.9379
quadrupole: -2.6028 -6.7280 -0.7575
quadrupole: 8.9148 10.3596 -19.2745 -2.6028 -6.7280 -0.7575
hfenergy: -1110.8037549 hartree
pointgroup: C01 [X(C26H20N2)]
dipole: 0.0028327 -0.7903276 -0.227666 debye
polarizability: 353.4866621|-5.1420929|486.0042167|13.2848906|12.1515813|155.6467106 unknown
InChI: InChI=1S/C26H20N2/c1-3-8-21-16-25(14-12-19(21)6-1)27-23-10-5-11-24(18-23)28-26-15-13-20-7-2-4-9-22(20)17-26/h1-18,27-28H
charge 0 multiplicity 1
48 atoms
N  2.474381 -2.456423 0.031606
N  -2.459689 -2.50292 -0.52196
C  2.868085 -1.107647 -0.109344
C  -2.835562 -1.146739 -0.403617
C  2.559277 1.341556 -0.038158
C  -2.667698 1.112659 0.574496
C  3.9437 1.546178 -0.412261
C  -3.784126 1.560389 -0.234918
C  1.205019 -3.067094 0.123835
C  -1.24054 -3.119414 -0.144311
C  2.048994 0.011875 0.119541
C  -2.21613 -0.24096 0.475033
C  -0.007381 -2.421173 -0.229461
C  4.246581 -0.893028 -0.483317
C  -3.949024 -0.697365 -1.201648
C  4.764947 0.38858 -0.620879
C  -4.408163 0.612662 -1.112667
C  1.173439 -4.43549 0.530519
C  -1.26401 -4.482909 0.254494
C  1.729684 2.494639 0.172931
C  -2.05654 2.049763 1.476036
C  4.446137 2.878889 -0.557453
C  -4.233222 2.915775 -0.126531
C  -0.050187 -5.127955 0.572629
C  2.246301 3.784431 0.024782
C  -2.520247 3.364746 1.565967
C  3.61564 3.982679 -0.342192
C  -3.614454 3.806842 0.755095
H  1.016123 -0.101921 0.455534
H  -1.402618 -0.577252 1.125732
H  3.254061 -3.115986 0.065884
H  -3.18381 -3.134157 -0.867946
H  -0.001061 -1.414005 -0.646855
H  4.887757 -1.765513 -0.665474
H  -4.425663 -1.403334 -1.893373
H  5.815763 0.525164 -0.902577
H  -5.255578 0.937015 -1.728342
H  2.104434 -4.942497 0.812257
H  -2.217618 -5.016939 0.333468
H  0.675906 2.352675 0.44056
H  -1.226114 1.713036 2.109354
H  5.495942 3.02188 -0.841718
H  -5.07625 3.245649 -0.746053
H  -0.062708 -6.178579 0.883055
H  1.598218 4.653533 0.184392
H  -2.046361 4.065834 2.262249
H  4.005917 4.99991 -0.456119
H  -3.964746 4.84174 0.833025
