program: Gaussian 09
title: 000020663
version: EM64L-G09RevD.01
frameworkgroup: C1[X(C16H17ClN4O4)]
method: RPBEPBE
basis: SDD
operation: Freq
keyword: #p
keyword: freq=noraman
keyword: PBEPBE/SDD
title: #p freq=noraman PBEPBE/SDD
converged: YES YES NO NO
title: Mulliken charges:
elementType: Cl O O O O N N N N C C C C C C C C C C C C C C C C H H H H H H H H H H H H H H H H H
charge: -0.018638 -0.443073 -0.424932 -0.215475 -0.217756 -0.153179 -0.067167 -0.130269 0.020431 -0.424309 -0.440461 0.477725 -0.320069 -0.325577 -0.327987 -0.337754 -0.328570 -0.303520 0.234478 0.174098 -0.263192 -0.324457 0.380617 -0.338510 -0.341403 0.251142 0.255712 0.224932 0.253291 0.223621 0.200577 0.219958 0.230873 0.269110 0.228555 0.281070 0.357008 0.342964 0.291747 0.256850 0.284974 0.286568
chargesum: 0.00000
title: Mulliken charges with hydrogens summed into heavy atoms:
elementType: Cl O O O O N N N N C C C C C C C C C C C C C C C C
charge: -0.018638 -0.086065 -0.081968 -0.215475 -0.217756 -0.153179 -0.067167 -0.130269 0.020431 0.082545 0.037762 0.477725 0.104128 0.125255 -0.058877 -0.109200 -0.328570 -0.022450 0.234478 0.174098 0.028555 -0.067608 0.380617 -0.053537 -0.054835
polarizability: 7.23859250e+02 3.75787019e+00 2.38515322e+02 7.84757897e-01 1.88488041e+01 1.11513922e+02
1716.lowfreq: -10.9259 -3.8481 -0.0024 -0.0023 -0.0015 2.5814 15.7044 19.2522 30.9676
frequency: 15.6779 19.0485 30.9515 33.6474 46.0251 50.3816 58.7801 68.9728 88.8191 104.0964 115.1273 138.9939 156.0194 159.5992 176.4561 189.8483 202.6573 243.5790 251.3322 263.6815 272.0463 289.7550 304.9687 311.9088 340.7019 371.1499 382.2827 388.7467 413.8281 418.2592 457.6168 472.5818 503.1354 514.0494 554.0530 559.7762 591.2534 615.9077 624.3671 659.7916 666.6228 669.3626 725.3962 750.9621 759.2459 793.1093 802.8376 811.6494 825.8082 839.0117 842.5547 850.4889 883.3937 896.3287 959.1903 970.0106 979.2059 987.5767 993.5929 994.1315 1003.6811 1010.8502 1015.9076 1023.2899 1045.0528 1090.8332 1098.9070 1101.2229 1131.2561 1150.3600 1152.1144 1189.0921 1194.9960 1209.9083 1213.4883 1224.7373 1256.8347 1260.4947 1282.0832 1286.2377 1288.2736 1302.9171 1324.1717 1337.3090 1348.9454 1354.8069 1364.8303 1378.2650 1393.3466 1404.6624 1415.5878 1427.6661 1455.2552 1463.8255 1474.0127 1483.5047 1490.3608 1496.4340 1514.2858 1521.4775 1580.2085 1599.8292 1619.6867 2950.7171 2984.5530 3001.8523 3004.1797 3025.8886 3062.7484 3085.3466 3089.8836 3150.7385 3162.0811 3166.6247 3171.5220 3184.9603 3186.3179 3188.4841 3571.4906 3585.7110
redmass: 7.6389 5.9379 8.5515 7.5267 7.7400 7.3683 6.6872 6.7872 3.4955 2.5977 2.4875 6.0266 10.0290 7.0967 6.4686 5.4613 5.5362 3.4615 4.7137 1.0977 1.4365 3.0472 6.0497 6.5620 5.2241 5.7302 4.7213 6.8811 3.2059 4.5810 3.5481 4.4211 7.2107 3.6135 5.8890 4.8586 3.7389 4.5580 7.0638 7.2901 4.6411 6.3543 3.5662 4.2836 7.1848 6.4842 1.1723 1.5170 1.1944 1.6106 5.1363 1.2493 1.6402 7.4798 2.8605 4.5117 1.3505 4.1415 2.7085 1.3732 3.3947 1.3368 3.2780 4.4278 1.5617 3.3332 1.5596 1.2654 1.8698 1.4257 1.4009 2.3475 1.6775 1.2339 4.5693 1.8894 1.9028 2.2568 1.2869 1.3982 1.1654 1.2025 6.4894 1.2826 1.2575 7.6942 3.4737 1.2834 2.2467 8.1118 1.4021 4.5442 3.9782 2.4319 1.1332 1.1143 1.1950 1.6331 1.5625 6.7454 7.8742 6.6335 6.8912 1.0560 1.0659 1.0637 1.1060 1.0603 1.0981 1.1042 1.1030 1.0870 1.0894 1.0885 1.0953 1.0962 1.0912 1.0966 1.0667 1.0669
irintensity: 0.1643 0.2973 0.7858 0.7671 0.0813 0.4466 2.0708 0.0800 3.0260 18.3852 4.0581 4.8534 1.7692 1.1220 1.0061 0.7957 3.3349 13.8905 9.7040 155.1187 124.6661 5.2911 5.1413 18.4215 18.7300 0.1619 6.7836 3.4446 0.7555 4.1113 5.2780 2.0164 1.9933 12.6191 2.7604 8.5973 12.0016 5.9939 0.8038 1.3299 29.3992 7.1433 1.2106 0.0035 35.2667 19.0783 25.5763 24.3860 14.6846 36.3013 38.7797 2.5735 72.8196 3.6735 86.9656 224.4143 5.4774 79.2052 0.0787 0.2516 11.4380 0.0153 51.4426 27.0560 23.0481 67.2099 1.8460 27.9422 336.7638 28.2266 39.8520 8.7837 536.4469 26.0961 1036.0703 25.5084 94.1709 37.7731 9.8091 18.4212 0.8601 13.4659 630.2824 3.7236 41.0657 104.6386 22.8292 19.2572 148.4895 8.8783 0.6250 33.5612 5.0493 0.2525 3.8316 13.0746 26.9665 82.7272 48.8011 66.7317 56.4199 295.5349 751.7293 49.4772 25.2535 57.1732 54.9500 43.2976 5.5526 17.4140 32.7526 3.9153 2.7146 1.2303 25.3178 0.2168 7.2086 0.4985 21.7873 11.3007
temp: 298.150 k
press: 1.00000 atm
elementType: 17 8 8 8 8 7 7 7 7 6 6 6 6 6 6 6 6 6 6 6 6 6 6 6 6 1 1 1 1 1 1 1 1 1 1 1 1 1 1 1 1 1
symmnumber: 1
zpe: 825509.8 jmol-1
zpe.correction: 0.314420 hartree
zpe.thermalcorrener: 0.338939 hartree
zpe.thermalcorrenthalpy: 0.339884 hartree
zpe.thermalcorrgfe: 0.256000 hartree
zpe.sumelectzpe: -1597.880649 hartree
zpe.sumelectthermal: -1597.856130 hartree
zpe.sumelectthermalent: -1597.855186 hartree
zpe.sumelectthermalfe: -1597.939070 hartree
dipole: -11.2620 1.7785 2.7142
dipole: 11.7202
quadrupole: -213.3000 -142.0706 -151.3116
quadrupole: 7.7010 -15.8713 -0.7632
quadrupole: -44.4060 26.8235 17.5825 7.7010 -15.8713 -0.7632
hfenergy: -1598.1950694 hartree
pointgroup: C01 [X(C16H17Cl1N4O4)]
dipole: -4.4390543 0.5693794 1.1102022 debye
polarizability: 723.7537977|7.6500568|234.4862563|2.6925272|29.3911947|115.6484392 unknown
InChI: InChI=1S/C16H17ClN4O4/c17-15-11-14(20(7-9-22)8-10-23)5-6-16(15)19-18-12-1-3-13(4-2-12)21(24)25/h1-6,11,22-23H,7-10H2
charge 0 multiplicity 1
42 atoms
Cl -0.590098 -2.929762 -0.891395
O  -6.778095 -2.966538 0.178726
O  -6.362059 3.539273 -0.272189
O  7.857136 -1.128622 -0.322884
O  8.061143 1.061076 0.290109
N  -4.706877 0.130527 0.007211
N  0.954284 -0.431918 -0.147175
N  1.681244 0.625369 0.158993
N  7.352044 0.018758 -0.002436
C  -5.589348 -0.982244 -0.397398
C  -5.375651 1.374696 0.439658
C  -3.31961 0.01364 -0.026736
C  -5.857585 -1.977417 0.749419
C  -5.545014 2.402879 -0.709973
C  -2.690543 -1.222394 -0.390783
C  -2.463054 1.12283 0.303801
C  -1.297293 -1.324562 -0.420474
C  -1.077103 0.992093 0.272308
C  -0.43641 -0.23526 -0.092056
C  3.087139 0.386416 0.093582
C  3.687691 -0.861998 -0.253824
C  3.90944 1.504748 0.406899
C  5.880494 0.146479 0.030948
C  5.083664 -0.982649 -0.285228
C  5.309209 1.392761 0.377523
H  -5.169354 -1.524082 -1.2622
H  -6.558187 -0.567917 -0.725892
H  -4.829085 1.830908 1.286511
H  -6.382814 1.122347 0.815585
H  -4.910566 -2.447614 1.085835
H  -6.314109 -1.446445 1.61191
H  -4.558381 2.727222 -1.098854
H  -6.111865 1.950188 -1.540141
H  -3.280429 -2.103966 -0.647036
H  -2.891992 2.089913 0.57828
H  -0.424516 1.835359 0.520162
H  -6.97281 -3.672734 0.843387
H  -5.829231 4.132035 0.314973
H  3.036001 -1.707453 -0.491143
H  3.421181 2.448292 0.669094
H  5.57584 -1.923075 -0.546985
H  5.963368 2.23574 0.613288
