program: Gaussian 09
title: 000235621
version: EM64L-G09RevD.01
frameworkgroup: C1[X(C24H22O3)]
method: RPBEPBE
basis: SDD
operation: Freq
keyword: #pfreq=noraman
keyword: PBEPBE/SDD
title: #p freq=noraman PBEPBE/SDD
converged: YES YES NO NO
title: Mulliken charges:
elementType: O O O C C C C C C C C C C C C C C C C C C C C C C C C H H H H H H H H H H H H H H H H H H H H H H
charge: -0.278054 -0.278024 -0.287431 0.392884 0.392874 0.387312 0.387329 0.362123 0.362143 -0.585252 -0.585251 -0.299315 -0.299323 -0.274714 -0.274765 -0.422554 -0.422623 -0.358512 -0.358490 -0.411249 -0.411257 -0.408930 -0.408923 -0.241603 -0.241595 -0.249137 -0.249151 0.257529 0.257525 0.220424 0.220991 0.220380 0.221044 0.208679 0.208448 0.208614 0.208515 0.234612 0.234613 0.251373 0.251402 0.237705 0.237705 0.237380 0.237381 0.226621 0.226619 0.226961 0.226967
chargesum: 0.00000
title: Mulliken charges with hydrogens summed into heavy atoms:
elementType: O O O C C C C C C C C C C C C C C C C C C C C C C C C
charge: -0.278054 -0.278024 -0.287431 0.392884 0.392874 0.387312 0.387329 0.362123 0.362143 -0.327723 -0.327726 0.142099 0.142102 0.142413 0.142364 -0.187942 -0.188010 -0.107140 -0.107088 -0.173544 -0.173552 -0.171549 -0.171541 -0.014982 -0.014977 -0.022176 -0.022185
polarizability: 4.98540589e+02 2.89324508e-02 2.57666534e+02 7.63028819e-02 8.87803504e-01 1.19562717e+02
1716.lowfreq: -12.4986 -2.3944 -0.0453 -0.0015 0.0008 3.8461 5.8475 9.2866 18.2884
frequency: 5.1951 9.2815 18.2873 25.0643 54.9026 60.8797 91.1690 100.6721 116.5715 121.3740 128.0260 141.0156 142.1001 145.1166 187.3044 187.3607 239.9358 279.9247 295.0973 295.1344 312.2303 375.1653 404.2657 404.2730 427.0958 434.3643 476.1549 476.2223 495.1303 513.2769 514.1702 530.9621 530.9910 545.4142 564.8571 618.0760 620.9978 646.8066 646.8455 710.5217 722.1932 756.0967 756.1294 757.9271 758.0158 776.9601 777.0095 811.6110 812.4770 839.0567 848.4933 862.8772 863.2903 865.7381 873.3772 902.1015 902.1565 930.5632 939.7529 947.6665 947.7428 951.9158 968.1795 968.2020 988.3803 988.3948 1002.7211 1008.6943 1022.0378 1022.1598 1066.9286 1097.3824 1099.5902 1118.1375 1119.7199 1125.1374 1128.6441 1164.6023 1164.8755 1167.7704 1169.0956 1171.2331 1173.2808 1174.0905 1180.4483 1241.2226 1241.6129 1259.4205 1262.1318 1262.4021 1265.3205 1273.2508 1273.2638 1307.3287 1337.0928 1357.2586 1357.9694 1380.4295 1406.2182 1412.8329 1420.1852 1422.8369 1425.8719 1440.1859 1440.2386 1462.6223 1463.5793 1478.0592 1485.6276 1490.3144 1497.0987 1515.4762 1515.9918 1579.1255 1579.2370 1605.4510 1605.8262 1643.4812 1644.0376 2948.8445 2955.7814 2975.3665 2976.1610 3004.1957 3006.1383 3048.0679 3048.6830 3118.7451 3118.7575 3124.7257 3124.7315 3127.4690 3127.5011 3142.0740 3142.0865 3150.8430 3150.8532 3161.2565 3161.2984 3163.1794 3163.2368
redmass: 3.9213 5.7297 5.7367 6.4256 6.1257 5.7700 2.0970 3.6646 7.3192 1.9533 4.4181 4.3211 3.7551 5.6097 3.5903 3.5613 5.0195 5.4787 5.0262 5.0290 5.0383 4.4867 3.1723 3.1725 4.5819 5.0509 2.4694 2.4707 5.7156 6.6221 6.5009 3.4825 3.4819 5.8909 4.6445 6.7229 6.6673 2.7574 2.7587 7.0907 7.0882 1.3172 1.3171 4.8213 4.8409 2.3813 2.3894 1.4119 1.4224 1.1129 1.1156 1.4553 1.4474 5.8962 5.3729 1.7292 1.7287 5.9845 4.7129 1.3481 1.3479 4.9028 1.4115 1.4115 1.3382 1.3382 4.7708 4.6272 2.2481 2.2506 6.3560 3.5966 1.4215 1.4640 2.2248 1.7831 2.0752 1.2136 1.2242 1.1035 1.5726 1.3047 1.1748 1.3767 1.1583 2.1366 2.0643 2.0885 2.2572 1.1388 1.1495 1.7417 1.7426 1.2062 1.3048 1.8103 1.8106 1.5471 3.2932 4.3112 2.8132 3.2481 2.1035 3.9576 3.9261 2.3409 2.3607 1.0939 1.1145 1.1160 1.0824 3.5358 3.5579 7.5626 7.5710 5.6628 5.6555 6.9492 6.9444 1.0555 1.0556 1.0548 1.0548 1.1059 1.1068 1.1104 1.1097 1.0858 1.0858 1.0887 1.0887 1.0885 1.0885 1.0950 1.0950 1.0918 1.0918 1.1000 1.1000 1.0952 1.0952
irintensity: 0.0000 0.0058 0.0145 0.0000 1.4217 0.2971 2.2302 0.0001 0.0132 0.0001 4.8284 0.0379 16.4530 1.3004 1.3356 0.0562 4.8587 1.8457 0.8943 2.4329 1.4262 7.2349 0.0056 0.1748 0.0166 0.1912 0.0922 50.5371 11.5939 0.2191 0.8005 0.0173 0.1585 13.1752 3.8540 0.3130 7.1456 0.0364 0.8460 8.2781 25.0982 5.8019 74.1205 2.1260 0.1885 0.0022 6.3463 0.0163 111.5452 0.0000 0.7447 0.0202 74.3325 7.3297 1.4230 0.9663 40.1247 6.6670 5.5825 0.0001 0.6706 3.9066 1.0380 16.5046 0.0413 0.0504 163.9102 2.1660 2.8882 0.1485 250.4405 167.1078 0.7781 0.0753 1.6181 62.3853 8.7091 28.7480 0.9505 0.6224 313.0231 3.7785 37.1244 15.4978 9.0282 112.5824 0.0725 405.1007 4.6286 0.1879 0.0381 0.4465 13.3468 10.2565 3.1388 2.5589 7.2992 1.9700 0.8157 2.6977 1.5862 2.2998 0.9046 0.4296 4.9126 128.8273 5.8269 0.7941 0.6170 45.6695 5.5830 147.9433 6.1580 5.8540 5.6106 105.7711 10.1653 206.1735 0.6649 21.9002 57.2339 39.9611 57.7765 37.6481 0.0043 0.7657 122.2722 3.0701 4.0313 1.1303 0.9898 3.5268 15.9209 18.8037 48.4813 6.4652 8.5223 91.1780 6.7796 6.2195 7.3144
temp: 298.150 k
press: 1.00000 atm
elementType: 8 8 8 6 6 6 6 6 6 6 6 6 6 6 6 6 6 6 6 6 6 6 6 6 6 6 6 1 1 1 1 1 1 1 1 1 1 1 1 1 1 1 1 1 1 1 1 1 1
symmnumber: 1
zpe: 1034040.6 jmol-1
zpe.correction: 0.393845 hartree
zpe.thermalcorrener: 0.417351 hartree
zpe.thermalcorrenthalpy: 0.418295 hartree
zpe.thermalcorrgfe: 0.335240 hartree
zpe.sumelectzpe: -1151.498636 hartree
zpe.sumelectthermal: -1151.475130 hartree
zpe.sumelectthermalent: -1151.474186 hartree
zpe.sumelectthermalfe: -1151.557241 hartree
dipole: -0.0005 1.0426 0.0123
dipole: 1.0427
quadrupole: -150.7598 -141.2898 -167.3820
quadrupole: 0.0025 0.0410 0.2033
quadrupole: 2.3841 11.8540 -14.2381 0.0025 0.0410 0.2033
hfenergy: -1151.892481 hartree
pointgroup: C01 [X(C24H22O3)]
dipole: 0.0005256 -0.0607226 0.4057027 debye
polarizability: 498.5201786|2.7676876|122.3891377|0.018276|-19.5053546|254.8605231 unknown
InChI: InChI=1S/C24H22O3/c1-3-7-21-17-23(11-9-19(21)5-1)26-15-13-25-14-16-27-24-12-10-20-6-2-4-8-22(20)18-24/h1-12,17-18H,13-16H2
charge 0 multiplicity 1
49 atoms
O  -3.599666 0.285298 -0.834936
O  3.598618 0.348361 -0.839482
O  0.000726 0.21406 -0.207119
C  -7.282427 0.245544 -0.41214
C  7.282135 0.360306 -0.42047
C  -7.424473 0.043587 1.018295
C  7.428577 0.151947 1.008599
C  -4.838679 0.199104 -0.173823
C  4.839548 0.2769 -0.180143
C  -5.974953 0.31922 -0.982102
C  5.973122 0.418355 -0.988768
C  -2.377773 0.178201 -0.026598
C  2.379625 0.216923 -0.030321
C  -1.219163 0.312026 -1.01334
C  1.217542 0.334917 -1.014925
C  -6.239338 -0.075012 1.812101
C  6.246118 0.011852 1.802871
C  -4.967337 -0.000523 1.240533
C  4.972593 0.071337 1.232963
C  -8.469846 0.36559 -1.212607
C  8.466891 0.502139 -1.221324
C  -8.738715 -0.029837 1.58811
C  8.744322 0.093841 1.576711
C  -9.73538 0.290067 -0.628445
C  9.733988 0.4412 -0.638822
C  -9.873895 0.090587 0.784172
C  9.876831 0.235255 0.772434
H  -5.846871 0.470675 -2.059025
H  5.841772 0.574134 -2.064681
H  -2.330315 -0.801574 0.487977
H  -2.332095 0.988156 0.727694
H  2.34951 -0.765683 0.480158
H  2.321233 1.02274 0.727537
H  -1.260029 -0.498993 -1.770443
H  -1.269905 1.289286 -1.537851
H  1.251037 1.314599 -1.536284
H  1.270751 -0.472799 -1.774803
H  -6.338429 -0.22761 2.893466
H  6.34852 -0.145391 2.88326
H  -4.081512 -0.095298 1.875142
H  4.088931 -0.039488 1.867983
H  -8.367094 0.517893 -2.293638
H  8.360867 0.659406 -2.301328
H  -8.839435 -0.182272 2.669701
H  8.848327 -0.063627 2.657268
H  -10.632897 0.383244 -1.250115
H  10.629423 0.550936 -1.26079
H  -10.873999 0.033457 1.227459
H  10.878115 0.189769 1.214392
