program: Gaussian 09
title: 000235619
version: EM64L-G09RevD.01
frameworkgroup: C1[X(C23H18O2)]
method: RPBEPBE
basis: SDD
operation: Freq
keyword: #pfreq=noraman
keyword: PBEPBE/SDD
title: #p freq=noraman PBEPBE/SDD
converged: YES YES NO NO
title: Mulliken charges:
elementType: O O C C C C C C C C C C C C C C C C C C C C C C C H H H H H H H H H H H H H H H H H H
charge: -0.467989 -0.429455 -0.494479 0.396666 0.186952 0.434698 0.457365 0.463771 -0.553392 -0.208560 0.115927 -0.384172 -0.418227 -0.422953 -0.377757 -0.384634 -0.417327 -0.285029 -0.271374 -0.236426 -0.234331 -0.244167 -0.238187 -0.242833 -0.246020 0.216125 0.284468 0.257177 0.236427 0.237039 0.256436 0.255038 0.188917 0.229430 0.229686 0.224255 0.224171 0.224755 0.225035 0.226609 0.226886 0.376127 0.383351
chargesum: 0.00000
title: Mulliken charges with hydrogens summed into heavy atoms:
elementType: O O C C C C C C C C C C C C C C C C C C C C C C C
charge: -0.091862 -0.046104 -0.278354 0.396666 0.186952 0.434698 0.457365 0.463771 -0.268924 -0.208560 0.115927 -0.126995 -0.181800 -0.185914 -0.121321 -0.129596 -0.228410 -0.055599 -0.041689 -0.012171 -0.010160 -0.019412 -0.013151 -0.016224 -0.019133
polarizability: 2.86764523e+02 -1.54626737e+01 2.75270600e+02 7.71300737e+00 -2.12431254e+01 2.02627617e+02
1716.lowfreq: -9.4607 -8.5322 -2.6761 -0.0005 -0.0004 0.0002 14.6288 27.9540 38.7884
frequency: 14.5149 27.8615 38.5816 44.9493 47.8502 57.7419 66.4842 104.9854 165.9118 170.6521 178.9280 215.9043 232.9484 251.9667 264.6797 282.3024 291.7224 293.8202 369.7635 402.4620 404.7672 424.8658 436.6278 468.2099 477.8093 491.7815 494.3050 515.0075 556.6896 575.6264 598.0008 615.3146 616.9151 636.6793 644.0752 671.9230 690.3930 705.7212 707.2529 710.4095 747.8034 756.2626 765.8878 788.1521 823.7527 829.1733 855.4036 858.0472 862.5123 867.1736 911.5701 926.1044 933.8155 944.1451 952.3873 978.5288 980.3742 982.5625 990.3347 991.1123 995.2086 996.9810 1017.8514 1027.4202 1030.1675 1039.8142 1072.6785 1081.3556 1084.1513 1145.2009 1168.7532 1171.1440 1171.3586 1180.0014 1181.9424 1186.7806 1188.4883 1190.6501 1203.6468 1249.4494 1260.1744 1267.2661 1293.6441 1321.8810 1335.2833 1340.0026 1375.7228 1381.4802 1386.7027 1412.6078 1426.1506 1437.4386 1441.6318 1447.1089 1463.7649 1480.3606 1481.3417 1525.8959 1590.0041 1592.9629 1605.6064 1609.0658 1612.0133 1612.7691 1635.0586 2971.0919 3086.8819 3111.9346 3114.8346 3122.9862 3124.5416 3134.8850 3135.2791 3136.7473 3145.2104 3147.2674 3152.2705 3161.6727 3162.4943 3166.0937 3168.6695 3526.4746 3627.0992
redmass: 4.2903 3.7750 3.0511 3.4558 1.8688 5.2369 5.0239 6.1638 2.6570 5.4226 6.1981 5.1517 4.4987 4.7940 4.7862 4.9497 5.2447 5.0241 5.6295 2.8130 2.8321 3.7087 5.6424 5.4643 3.8284 3.9916 1.1764 3.1131 5.1322 4.6507 5.3096 6.3886 6.3080 5.4532 4.6529 4.3502 5.3286 1.6991 1.7700 5.2820 2.0463 1.5386 2.1623 2.2715 2.8357 3.6714 1.2508 1.2641 3.2395 2.0910 1.6595 1.4797 1.6064 1.4345 3.5710 1.3935 1.4043 1.3459 5.7027 6.1008 1.3198 1.3176 4.2879 2.1941 2.4629 2.1529 3.8908 1.6775 1.6670 1.5336 1.5975 1.0624 1.0556 1.5323 1.2759 1.6465 1.1748 1.1146 2.4367 1.6748 1.7950 1.5716 1.6035 1.5624 1.8430 1.3193 4.8155 2.8294 5.7238 5.8718 4.1184 2.2695 2.1907 2.7406 3.1022 2.2523 2.2372 4.0918 6.1435 5.9903 7.5339 6.0007 5.8154 6.1040 6.8735 1.0815 1.0879 1.0873 1.0868 1.0859 1.0863 1.0911 1.0874 1.0915 1.0957 1.0956 1.0929 1.1014 1.1014 1.0915 1.0989 1.0647 1.0661
irintensity: 4.4377 0.8079 11.7578 17.4872 46.3096 0.4748 0.7375 0.1801 49.5406 1.8610 1.7527 0.1355 0.9815 0.7600 0.2102 1.0487 4.8329 4.6940 2.9661 0.2226 0.1217 12.6181 5.8692 1.8509 2.5770 5.6995 104.9059 25.9247 17.8621 14.0017 42.0766 3.2382 4.1873 8.9331 12.5616 1.8144 18.4807 69.5050 49.2950 2.8236 30.3956 89.4691 19.4134 3.0308 15.1729 8.8290 0.1162 0.1713 12.8055 3.6304 6.9300 4.9368 3.3799 1.1476 10.6124 0.0162 0.0093 0.1261 0.5603 1.1805 0.3277 0.2876 3.2052 14.6198 7.7320 10.7637 94.2839 2.6044 19.3040 134.7605 45.2657 1.3589 0.0203 12.7546 40.2528 86.6820 5.1413 1.6558 2.4932 160.2271 41.7748 1.3993 9.6668 5.8677 0.0766 1.0074 24.1918 51.2717 2.5519 5.5614 31.4787 8.3779 3.4167 23.7796 37.1692 16.1764 26.8366 12.3629 4.3778 0.0531 1.1008 19.3972 33.8529 5.7489 68.9041 10.9582 26.8453 7.3309 7.3061 0.0768 0.0505 12.1564 6.7225 18.3411 31.3887 33.7865 29.5137 34.6320 25.6416 1.3391 19.9871 83.5616 43.2314
temp: 298.150 k
press: 1.00000 atm
elementType: 8 8 6 6 6 6 6 6 6 6 6 6 6 6 6 6 6 6 6 6 6 6 6 6 6 1 1 1 1 1 1 1 1 1 1 1 1 1 1 1 1 1 1
symmnumber: 1
zpe: 888986.4 jmol-1
zpe.correction: 0.338597 hartree
zpe.thermalcorrener: 0.359408 hartree
zpe.thermalcorrenthalpy: 0.360353 hartree
zpe.thermalcorrgfe: 0.286526 hartree
zpe.sumelectzpe: -1035.989235 hartree
zpe.sumelectthermal: -1035.968424 hartree
zpe.sumelectthermalent: -1035.967480 hartree
zpe.sumelectthermalfe: -1036.041307 hartree
dipole: -1.8014 1.4662 -0.8830
dipole: 2.4848
quadrupole: -121.7245 -141.6333 -140.2706
quadrupole: 0.0141 -0.3111 1.3212
quadrupole: 12.8183 -7.0905 -5.7278 0.0141 -0.3111 1.3212
hfenergy: -1036.3278324 hartree
pointgroup: C01 [X(C23H18O2)]
dipole: -0.7156077 0.5601666 -0.3603229 debye
polarizability: 287.0195254|-15.6645511|272.9534188|6.504324|-24.5804613|204.6897956 unknown
InChI: InChI=1S/C23H18O2/c24-21-15-20(18-13-7-8-14-19(18)23(21)25)22(16-9-3-1-4-10-16)17-11-5-2-6-12-17/h1-15,22,24-25H
charge 0 multiplicity 1
43 atoms
O  -4.215787 -1.793924 1.339815
O  -1.903288 -2.977051 2.066453
C  0.891626 0.123399 -0.648959
C  -0.485103 -0.345855 -0.142174
C  -1.6867 0.349696 -0.556229
C  1.954816 -0.990188 -0.596047
C  1.372716 1.421729 0.025694
C  -2.984256 -0.109389 -0.08547
C  -0.594734 -1.436041 0.726657
C  -3.03279 -1.232794 0.798231
C  -1.858018 -1.880559 1.199352
C  -1.659429 1.49189 -1.424109
C  1.964189 -1.977806 -1.61508
C  2.250265 2.281925 -0.68383
C  2.915347 -1.077912 0.441037
C  1.000024 1.773406 1.345929
C  -4.171553 0.573051 -0.5151
C  -2.830213 2.139461 -1.826661
C  -4.100893 1.67323 -1.370934
C  2.907486 -3.0275 -1.60046
C  2.74203 3.465723 -0.092777
C  3.861947 -2.128587 0.460088
C  1.490963 2.95774 1.942561
C  3.862437 -3.107283 -0.559267
C  2.363232 3.808724 1.226749
H  0.768468 0.358985 -1.726623
H  0.29027 -1.990005 1.051413
H  -0.695966 1.881002 -1.765228
H  1.220934 -1.924167 -2.420696
H  2.55512 2.014924 -1.703941
H  2.931239 -0.315538 1.227397
H  0.315878 1.12403 1.903578
H  -5.162687 0.240869 -0.175489
H  -2.776083 3.010564 -2.487984
H  -5.016934 2.182603 -1.688816
H  2.900306 -3.779621 -2.397567
H  3.416721 4.119324 -0.657446
H  4.598937 -2.180202 1.269665
H  1.189729 3.216226 2.964227
H  4.597749 -3.919645 -0.54532
H  2.740423 4.728291 1.688251
H  -5.026965 -1.323287 1.035212
H  -2.852549 -3.163441 2.293296
