program: Gaussian 09
title: 000235616
version: EM64L-G09RevD.01
frameworkgroup: C1[X(C22H18O2)]
method: RPBEPBE
basis: SDD
operation: Freq
keyword: #pfreq=noraman
keyword: PBEPBE/SDD
title: #p freq=noraman PBEPBE/SDD
converged: YES YES NO NO
title: Mulliken charges:
elementType: O O C C C C C C C C C C C C C C C C C C C C C C H H H H H H H H H H H H H H H H H H
charge: -0.270487 -0.293171 0.053978 0.078467 0.220067 0.216291 0.393153 0.389094 0.166399 0.155775 -0.464282 -0.467514 -0.390321 -0.367805 -0.390783 -0.390573 -0.449872 -0.449833 -0.267040 -0.263509 -0.255573 -0.253679 -0.535537 -0.531199 0.239983 0.240687 0.264774 0.261360 0.254891 0.255282 0.240364 0.240392 0.227362 0.227453 0.228357 0.228318 0.230105 0.253087 0.250268 0.248976 0.231095 0.245204
chargesum: 0.00000
title: Mulliken charges with hydrogens summed into heavy atoms:
elementType: O O C C C C C C C C C C C C C C C C C C C C C C
charge: -0.270487 -0.293171 0.053978 0.078467 0.220067 0.216291 0.393153 0.389094 0.166399 0.155775 -0.224299 -0.226827 -0.125546 -0.106445 -0.135893 -0.135292 -0.209508 -0.209441 -0.039679 -0.036056 -0.027216 -0.025361 0.197922 0.194075
polarizability: 2.95603078e+02 2.91179903e+00 2.43539160e+02 -2.77598556e+00 -1.52616178e-02 2.16738361e+02
1716.lowfreq: -0.0011 -0.0008 -0.0007 5.6395 10.2307 12.7315 30.5378 44.9633 50.5849
frequency: 30.4451 44.9145 50.5393 63.3276 83.8308 102.7539 108.1408 147.5633 152.6584 159.8082 199.3276 227.5179 235.5437 238.8915 260.2627 282.1929 329.0138 351.0905 355.2520 376.4095 413.9958 422.3061 433.5764 435.7229 492.3948 512.4996 516.8852 530.6415 536.6435 543.3836 570.3257 582.6544 627.4682 644.5283 670.5112 675.0919 690.7654 711.3372 762.2183 764.2425 772.6858 793.8634 796.2504 832.1805 833.6116 842.6200 879.4458 881.1889 890.7574 892.5129 935.7288 958.7829 959.0392 977.7519 978.3814 990.6432 993.2686 993.7068 1008.1638 1034.0330 1035.6651 1068.0277 1108.8503 1111.7256 1127.6907 1147.5528 1150.8182 1155.1982 1160.3889 1171.6854 1173.6349 1204.2448 1217.4997 1224.5237 1233.3336 1236.7616 1268.5139 1275.6166 1319.3785 1339.8019 1393.8719 1403.4298 1409.3869 1416.1829 1422.5875 1429.8962 1436.0086 1439.6424 1460.1657 1460.5105 1467.9713 1471.1167 1472.9641 1476.4068 1509.6506 1514.1482 1568.9833 1578.3372 1602.0471 1606.2989 1625.6012 1626.1284 2989.1236 2991.1115 3095.4658 3096.5788 3114.7413 3115.6066 3119.4621 3119.7585 3130.2589 3130.4284 3131.6787 3132.9517 3148.3576 3151.5312 3163.0853 3164.9957 3168.0307 3169.4137
redmass: 5.6924 3.4396 4.0559 3.8931 3.2406 4.9637 5.2768 4.1237 4.2448 5.2452 1.4503 2.2724 3.7519 3.7350 3.2760 1.0896 4.2544 5.0588 4.7244 4.6582 4.5731 4.4271 3.9765 4.1732 4.6335 4.6591 5.0866 5.7654 3.5404 3.6617 4.1491 3.9557 5.9524 5.8773 4.3050 4.2064 5.7347 5.3638 1.3107 1.2802 4.9692 3.6687 3.6532 1.4686 1.4603 4.4161 2.4415 2.3492 2.7723 3.0761 5.7786 1.3400 1.3429 1.3908 1.3910 4.4979 1.4474 1.3716 5.2061 2.2109 2.2477 2.7540 1.2425 1.2473 1.6991 1.3492 1.2432 1.3300 1.3270 1.1312 1.1151 1.6929 2.7657 2.4958 2.0006 2.5886 1.7977 1.7462 2.9271 5.0811 3.0842 2.2677 3.6529 4.3320 3.1964 2.7946 1.7178 1.5757 1.0820 1.6174 1.9021 1.0749 1.0679 1.0797 3.6262 3.9340 8.2027 8.6612 6.2623 6.1953 6.5639 6.6725 1.0298 1.0292 1.1044 1.1047 1.1040 1.1037 1.0866 1.0866 1.0889 1.0887 1.0883 1.0887 1.0938 1.0941 1.1002 1.0995 1.0960 1.0959
irintensity: 0.8648 1.1900 0.5241 2.6960 3.7858 1.1952 2.9124 0.4813 0.8189 0.6085 0.6120 2.1950 3.7553 6.3515 4.0978 1.4998 1.0478 1.3692 2.3602 0.9326 8.0123 10.1185 0.0631 0.4882 9.2281 2.4568 2.5006 3.0015 1.2595 4.7011 8.8218 4.5102 4.9898 10.1618 3.3190 2.5864 2.0061 0.3125 43.1306 32.6380 0.1495 3.6054 2.8323 55.8358 60.8249 3.3004 15.2379 20.2249 2.9032 0.9896 11.1034 0.5389 0.5084 1.7616 0.5117 34.2298 3.0508 2.1139 81.5648 1.4475 0.7386 22.7471 2.3982 0.5257 5.6885 0.4657 3.7277 4.8135 12.1879 8.3159 11.1323 6.9500 146.3291 100.7117 11.5819 29.8313 19.8858 7.6074 4.3534 39.5753 117.0462 11.4521 12.4683 27.9904 3.6190 0.1373 4.1090 1.3471 23.2679 15.8555 19.7216 10.0703 28.6023 57.3755 21.7487 17.3335 21.8948 19.5399 21.5500 19.4547 21.0459 33.4147 60.0530 57.6937 22.2754 21.0783 27.0539 29.6563 3.6632 2.6353 5.6415 0.7027 18.2334 12.4894 29.8525 23.5841 32.4201 28.5353 11.4116 10.3991
temp: 298.150 k
press: 1.00000 atm
elementType: 8 8 6 6 6 6 6 6 6 6 6 6 6 6 6 6 6 6 6 6 6 6 6 6 1 1 1 1 1 1 1 1 1 1 1 1 1 1 1 1 1 1
symmnumber: 1
zpe: 874686.2 jmol-1
zpe.correction: 0.333150 hartree
zpe.thermalcorrener: 0.353147 hartree
zpe.thermalcorrenthalpy: 0.354091 hartree
zpe.thermalcorrgfe: 0.284692 hartree
zpe.sumelectzpe: -997.920625 hartree
zpe.sumelectthermal: -997.900629 hartree
zpe.sumelectthermalent: -997.899684 hartree
zpe.sumelectthermalfe: -997.969083 hartree
dipole: -0.1133 -0.1667 -0.6356
dipole: 0.6668
quadrupole: -122.4617 -136.0090 -137.2847
quadrupole: -0.0297 -0.7909 -0.5928
quadrupole: 9.4568 -4.0905 -5.3663 -0.0297 -0.7909 -0.5928
hfenergy: -998.2537752 hartree
pointgroup: C01 [X(C22H18O2)]
dipole: -0.038503 0.0898543 0.2434325 debye
polarizability: 294.9932867|-6.2107442|243.9448439|2.8520768|-2.5311193|216.9424691 unknown
InChI: InChI=1S/C22H18O2/c1-23-19-13-11-15-7-3-5-9-17(15)21(19)22-18-10-6-4-8-16(18)12-14-20(22)24-2/h3-14H,1-2H3
charge 0 multiplicity 1
42 atoms
O  -0.443392 -2.405249 -1.880857
O  0.169696 -2.343902 2.1133
C  -0.751605 -0.518982 -0.212854
C  0.621934 -0.546419 0.404825
C  -1.681255 0.509403 0.229387
C  1.637187 0.341494 -0.13744
C  -2.993159 0.632377 -0.370892
C  2.980812 0.342228 0.406278
C  -1.159885 -1.373649 -1.260217
C  0.977892 -1.376118 1.487284
C  -3.3548 -0.270702 -1.425565
C  3.28916 -0.545179 1.490186
C  -1.336958 1.430169 1.276487
C  1.357685 1.220928 -1.237782
C  -2.463672 -1.24069 -1.856301
C  2.312779 -1.380023 2.015793
C  -3.896545 1.643584 0.088984
C  3.972423 1.214001 -0.149204
C  -2.236387 2.411087 1.705721
C  2.345298 2.05887 -1.763117
C  -3.531128 2.522366 1.111934
C  3.665769 2.061713 -1.21607
C  0.821146 -2.944135 -1.355215
C  -1.286324 -2.162533 2.261712
H  -4.344427 -0.185349 -1.889301
H  4.304286 -0.553031 1.903979
H  -0.345592 1.362981 1.735798
H  0.350623 1.229029 -1.66558
H  -2.712707 -1.939558 -2.660319
H  2.519056 -2.06252 2.845601
H  -4.885473 1.717402 -0.379723
H  4.982343 1.20206 0.278444
H  -1.945258 3.104122 2.502993
H  2.106402 2.721229 -2.60259
H  -4.227256 3.294448 1.457014
H  4.429878 2.724816 -1.636021
H  1.050205 -3.786722 -2.026095
H  0.699053 -3.309775 -0.320689
H  1.631391 -2.197961 -1.400623
H  -1.526365 -1.138408 2.596384
H  -1.57435 -2.890302 3.036445
H  -1.823476 -2.379001 1.323405
