program: Gaussian 09
title: 000235614
version: EM64L-G09RevD.01
frameworkgroup: C1[X(C21H20O)]
method: RPBEPBE
basis: SDD
operation: Freq
keyword: #pfreq=noraman
keyword: PBEPBE/SDD
title: #p freq=noraman PBEPBE/SDD
converged: YES YES NO NO
title: Mulliken charges:
elementType: O C C C C C C C C C C C C C C C C C C C C C H H H H H H H H H H H H H H H H H H H H
charge: -0.462730 -0.096887 0.372402 0.350354 0.316535 -0.377841 -0.402337 -0.387892 -0.390165 -0.354585 -0.388840 -0.409147 -0.412227 -0.416922 -0.381738 0.439147 0.434749 -0.248983 -0.228244 -0.242236 -0.808582 -0.808744 0.258145 0.263726 0.261090 0.274628 0.249474 0.287903 0.348113 0.230008 0.229729 0.231639 0.227163 0.223202 0.223697 0.224715 0.224718 0.226004 0.236823 0.225663 0.224530 0.233946
chargesum: 0.00000
title: Mulliken charges with hydrogens summed into heavy atoms:
elementType: O C C C C C C C C C C C C C C C C C C C C C
charge: -0.114617 -0.096887 0.372402 0.350354 0.316535 -0.119695 -0.138611 -0.126802 -0.115537 -0.105111 -0.100937 -0.179139 -0.182498 -0.185284 -0.154575 0.439147 0.434749 -0.025781 -0.004548 -0.017521 -0.121038 -0.124605
polarizability: 2.54841728e+02 7.05583644e+00 2.47421585e+02 -6.28413323e+00 5.51571828e+00 1.75214824e+02
1716.lowfreq: -39.7678 -8.3376 -5.8079 -0.0004 0.0002 0.0008 5.2966 21.8359 36.1509
frequency: -39.7051 20.6286 36.0832 41.4111 44.6614 58.7588 62.0523 69.8485 146.1353 155.6509 206.1415 224.8840 247.1117 249.2156 267.9865 275.9387 311.5768 343.7818 355.1976 366.8240 379.3954 403.2776 404.7370 412.2805 463.7016 485.6782 525.2235 567.1509 571.0547 592.5258 616.6312 635.5490 637.2079 658.1648 705.1926 730.0177 732.5824 757.6040 788.4536 792.0598 821.2150 827.6049 851.5217 859.4551 860.3135 889.0762 901.0593 937.0167 948.8916 964.2281 966.5297 978.2316 984.2151 984.8653 987.9132 989.0180 990.3838 1000.6067 1014.5578 1015.6714 1029.2407 1046.7434 1047.1173 1085.3550 1123.1425 1128.6239 1147.4586 1162.0867 1171.1224 1190.0412 1192.2738 1199.4161 1214.2718 1223.1532 1226.2063 1292.7117 1306.2086 1314.0627 1322.0554 1361.4406 1368.9896 1380.4021 1396.5846 1396.7957 1402.5523 1406.7248 1433.0562 1470.3921 1471.4559 1473.0308 1473.4205 1481.4235 1501.5018 1503.4998 1576.3377 1581.5941 1590.8595 1611.2544 1621.0163 1622.2814 2973.5265 2974.5778 3054.5852 3055.8927 3083.7450 3084.8767 3109.6567 3114.6705 3119.3164 3120.9408 3121.1515 3131.7132 3133.7289 3140.8318 3145.4641 3157.5629 3158.7186 3159.2024 3180.6954 3553.7263
redmass: 1.0155 3.7785 3.0307 1.4339 2.3019 3.9324 4.0141 3.8908 4.2357 4.1456 3.8520 3.3738 3.8158 4.3799 1.8271 2.7290 3.7630 4.3470 3.0859 4.0269 3.2469 2.8612 2.8651 2.9482 3.8452 3.8073 3.2228 3.6614 4.2237 4.3645 6.4082 6.9426 6.8524 5.8938 1.8520 3.3622 3.1513 2.0477 3.6315 4.4125 1.6192 1.4987 1.2514 1.2514 1.2493 3.1267 3.1733 2.2164 2.5921 1.5866 1.3264 1.3744 1.3685 1.4035 1.4125 1.4508 5.8964 1.3307 2.9161 2.8429 2.2250 1.5590 1.5645 1.5953 1.3292 1.3245 2.4986 2.4350 1.0721 1.1738 1.1592 1.1339 4.0949 2.6882 2.6720 1.7319 1.3025 1.2991 1.3633 5.0794 5.9036 8.7746 1.2251 1.2245 3.2974 3.0933 2.2201 1.0946 1.0930 1.0542 1.0556 2.2437 2.5953 2.5465 5.9571 6.3015 6.2873 6.0478 6.3226 6.3712 1.0387 1.0387 1.0948 1.0949 1.0997 1.0998 1.0868 1.0876 1.0892 1.0878 1.0859 1.0887 1.0961 1.0954 1.0938 1.0945 1.0946 1.0992 1.0948 1.0659
irintensity: 0.5998 0.0287 0.2199 0.6910 0.1832 0.0670 0.4189 0.4378 0.0653 0.4548 6.8238 5.3399 8.9580 3.7537 77.2000 38.6433 50.5010 1.2378 2.2586 8.0367 1.2059 0.2256 0.6806 0.7518 16.2929 0.7623 6.1783 7.4812 24.7176 17.8720 0.0835 0.7079 0.3002 10.0712 48.0522 8.0260 2.1480 65.3412 5.6939 4.6541 82.1266 31.7156 0.3599 0.4841 0.5045 12.8631 25.8029 20.1201 15.0058 7.0186 1.5736 0.4091 0.1219 2.1860 2.4248 3.4460 0.9686 0.1209 4.8645 4.9667 11.4034 18.0815 19.7321 2.3606 8.3631 3.8716 29.6349 16.4561 1.2881 19.2078 9.4370 7.2192 20.8379 0.5355 0.5710 48.3725 0.6140 0.1337 22.1058 1.1417 3.9729 1.7947 11.0024 9.6924 3.2608 2.4932 17.3866 16.7756 17.6480 12.7950 11.6322 19.4547 25.2851 40.3790 0.7122 1.5965 0.2894 6.2818 4.8620 2.6652 45.0892 37.4842 22.7378 21.7123 17.5351 17.1651 14.5514 16.2688 27.0068 13.3711 5.9722 12.1633 20.7845 12.0283 35.7010 5.3057 3.8302 27.9306 7.4082 7.6589
temp: 298.150 k
press: 1.00000 atm
elementType: 8 6 6 6 6 6 6 6 6 6 6 6 6 6 6 6 6 6 6 6 6 6 1 1 1 1 1 1 1 1 1 1 1 1 1 1 1 1 1 1 1 1
symmnumber: 1
zpe: 898606.3 jmol-1
zpe.correction: 0.342261 hartree
zpe.thermalcorrener: 0.361721 hartree
zpe.thermalcorrenthalpy: 0.362665 hartree
zpe.thermalcorrgfe: 0.292498 hartree
zpe.sumelectzpe: -885.916790 hartree
zpe.sumelectthermal: -885.897330 hartree
zpe.sumelectthermalent: -885.896385 hartree
zpe.sumelectthermalfe: -885.966553 hartree
dipole: 0.6299 -1.9930 -0.8367
dipole: 2.2514
quadrupole: -116.6140 -119.2589 -125.8331
quadrupole: 1.1512 -0.5073 -2.2057
quadrupole: 3.9547 1.3097 -5.2644 1.1512 -0.5073 -2.2057
hfenergy: -886.2590508 hartree
pointgroup: C01 [X(C21H20O1)]
dipole: -0.2839231 0.6983267 -0.4651189 debye
polarizability: 254.5727368|7.9415808|243.2188474|3.1840797|-18.7752595|179.6865522 unknown
InChI: InChI=1S/C21H20O/c1-16-8-12-19(13-9-16)21(22,18-6-4-3-5-7-18)20-14-10-17(2)11-15-20/h3-15,22H,1-2H3
charge 0 multiplicity 1
42 atoms
O  -0.022883 0.029076 2.28958
C  -0.002891 -0.104063 0.799741
C  -1.343232 0.462815 0.276678
C  1.231976 0.647861 0.250131
C  0.141898 -1.617201 0.533019
C  -2.425265 -0.369852 -0.096177
C  1.260118 1.226645 -1.042619
C  -1.554278 1.868432 0.280905
C  2.413036 0.693363 1.032379
C  0.488603 -2.087023 -0.758837
C  -0.105226 -2.558482 1.56104
C  -3.673166 0.183867 -0.456465
C  2.43289 1.843248 -1.532232
C  -2.803641 2.417558 -0.073354
C  3.581104 1.311711 0.540436
C  -3.890493 1.584623 -0.445801
C  3.61344 1.902475 -0.749637
C  0.585513 -3.471294 -1.018218
C  -0.000063 -3.944985 1.303668
C  0.342618 -4.408408 0.013385
C  -5.24545 2.172706 -0.799234
C  4.863545 2.595161 -1.264527
H  -2.292019 -1.456024 -0.109266
H  0.361186 1.20377 -1.669141
H  -0.727774 2.541554 0.541264
H  2.401531 0.234861 2.026276
H  0.695636 -1.372537 -1.562705
H  -0.368236 -2.190686 2.555728
H  -0.284873 0.961995 2.500017
H  -4.492974 -0.484277 -0.748033
H  2.430296 2.284911 -2.536612
H  -2.936902 3.506463 -0.066259
H  4.484057 1.333448 1.163527
H  0.856577 -3.817318 -2.022225
H  -0.187963 -4.661441 2.11173
H  0.423496 -5.483047 -0.186223
H  -5.149723 3.189512 -1.21919
H  -5.779248 1.546521 -1.535696
H  -5.891615 2.247205 0.097285
H  5.779338 2.135824 -0.852097
H  4.925813 2.552625 -2.366312
H  4.874545 3.664511 -0.97583
