program: Gaussian 09
title: 000235612
version: EM64L-G09RevD.01
frameworkgroup: C1[X(C21H16N2O9S2)]
method: RPBEPBE
basis: SDD
operation: Freq
keyword: #p
keyword: freq=noraman
keyword: PBEPBE/SDD
title: #p freq=noraman PBEPBE/SDD
converged: YES YES NO NO
title: Mulliken charges:
elementType: S S O O O O O O O O O N N C C C C C C C C C C C C C C C C C C C C C H H H H H H H H H H H H H H H H
charge: 0.986049 0.986157 -0.412619 -0.412543 -0.566360 -0.566459 -0.501705 -0.500397 -0.501635 -0.500367 -0.270901 -0.511661 -0.511669 0.303726 0.303946 0.446697 0.446389 0.504515 0.504514 -0.621573 -0.621214 -0.059560 -0.059831 -0.452374 -0.450736 0.153168 0.153434 -0.436367 -0.436431 -0.385142 -0.386731 -0.350591 -0.350641 0.281044 0.187210 0.186901 0.296906 0.296556 0.254971 0.254943 0.306900 0.307239 0.317359 0.317350 0.293225 0.293205 0.359636 0.359620 0.382919 0.382931
chargesum: 0.00000
title: Mulliken charges with hydrogens summed into heavy atoms:
elementType: S S O O O O O O O O O N N C C C C C C C C C C C C C C C C C C C C C
charge: 0.986049 0.986157 -0.052984 -0.052923 -0.183442 -0.183528 -0.501705 -0.500397 -0.501635 -0.500367 -0.270901 -0.218437 -0.218464 0.303726 0.303946 0.446697 0.446389 0.504515 0.504514 -0.434363 -0.434313 -0.059560 -0.059831 -0.155468 -0.154180 0.153168 0.153434 -0.181395 -0.181488 -0.078242 -0.079492 -0.033232 -0.033291 0.281044
polarizability: 7.70280989e+02 -6.35507933e-02 3.20188021e+02 1.78319889e+00 2.91577242e-02 1.60781615e+02
1716.lowfreq: -0.0023 -0.0022 -0.0020 2.1311 5.3767 8.3619 9.8289 10.9017 24.5649
frequency: 9.4994 10.7718 24.5467 26.8671 28.6775 35.0174 60.3411 62.0635 78.4502 83.3160 98.9701 108.6033 111.2283 117.6839 146.2868 159.9641 161.7149 168.9051 169.0981 195.5668 195.7099 208.7175 218.8205 223.9928 226.5915 230.6266 232.1026 249.0236 259.3325 275.7813 283.6116 319.6875 321.4714 323.8621 330.7201 362.4959 369.8991 378.1544 394.8582 413.9113 422.1325 426.6725 429.0830 475.0733 476.0861 497.2163 497.8585 515.6663 527.6433 532.7997 535.6286 537.7663 545.5722 550.6850 551.2427 597.2441 599.5814 620.1490 624.4488 677.1080 678.0423 693.3868 697.3659 742.1951 762.3866 764.1147 764.8385 780.3535 804.5197 833.7776 835.7655 846.1061 847.2294 850.3942 852.4549 862.9736 868.4042 883.5373 883.9791 914.6149 915.0460 915.5250 916.4906 969.1123 969.3653 1007.0130 1008.2854 1031.4335 1047.8497 1048.1697 1050.0701 1050.6602 1080.9516 1082.3191 1127.4649 1130.5423 1165.6133 1166.0645 1170.1321 1220.1502 1220.4107 1237.5533 1253.6832 1278.9078 1278.9390 1292.9039 1309.1057 1332.6264 1336.0776 1394.4976 1401.6280 1417.9617 1420.6854 1433.5916 1433.6287 1453.3110 1453.7886 1493.9943 1507.7935 1541.9129 1544.0347 1593.0899 1593.9475 1601.1179 1605.7981 1637.4177 1638.5671 1661.8514 3082.7688 3082.9525 3146.2452 3146.2885 3159.1158 3159.1573 3179.6352 3179.8241 3203.1219 3203.4651 3479.4790 3479.7096 3515.4392 3527.9531 3587.2978 3587.6370
redmass: 7.4956 10.0732 8.2445 8.1133 9.6216 6.5959 6.3626 7.7826 9.1487 5.5298 9.9550 4.2209 3.3249 9.7014 8.0019 2.2329 1.7753 2.5620 2.7263 2.7121 7.4775 1.6626 3.8829 3.7607 6.5703 4.0712 2.2597 5.4583 3.3702 3.8364 4.2957 7.5770 10.0137 8.6641 8.9366 7.0633 4.9542 3.5796 5.2076 8.2865 4.8208 3.3864 4.6815 6.5597 1.9491 6.7486 5.3947 7.7250 5.6844 6.4145 4.2905 8.4111 4.3811 3.3133 4.9802 4.2213 5.3685 7.5240 1.3377 3.4696 3.5992 6.7485 9.5315 6.5326 2.2033 2.3125 5.7566 7.8391 7.2138 10.7975 9.5040 1.3821 1.3804 2.0178 1.9943 6.1566 5.7114 1.5119 1.5089 3.5585 3.6080 1.9836 1.9454 16.9974 16.5895 1.3351 1.3304 5.4850 1.4432 1.3341 1.9981 2.1556 2.2100 2.2317 1.3291 1.2742 1.5291 1.3293 2.0855 1.3787 1.3763 1.7203 1.6466 2.1233 2.2109 2.4609 2.5696 2.6603 2.4200 3.5299 3.6116 3.1701 3.2926 8.8636 8.7015 3.1068 3.2598 2.8616 3.1617 2.6547 2.8259 7.5228 7.8700 5.9743 5.7033 6.5608 6.2774 3.9340 1.0895 1.0895 1.0914 1.0914 1.0928 1.0929 1.0929 1.0929 1.0949 1.0948 1.0661 1.0661 1.0767 1.0755 1.0658 1.0658
irintensity: 0.3631 1.3773 1.8999 0.1777 1.3205 1.6081 0.5877 7.5628 1.7191 0.0286 0.1553 18.3001 1.0785 0.9951 9.5235 2.7536 90.0948 10.2503 9.5362 25.1626 22.2543 124.1527 1.8188 0.5195 22.4679 17.8177 12.2022 15.1872 4.1260 49.5895 77.0327 2.0354 21.2937 15.8261 59.0191 46.6481 4.0524 0.1277 1.9317 131.0360 7.3324 52.1249 1.0077 43.6105 0.0904 8.6934 5.7594 4.4263 4.1310 293.5401 17.4175 5.0082 111.3478 1.1844 19.4486 42.3846 0.3066 0.4038 184.6526 0.2104 18.5117 1.2675 21.9163 27.0159 0.1696 5.8918 20.0697 5.9537 5.6160 170.1079 8.4770 0.3150 0.8328 0.2260 146.0211 11.5237 76.6189 7.7062 9.4111 12.3750 39.5433 1.8090 82.2564 129.1316 7.7317 0.0010 1.0994 1.8709 94.3778 0.0406 125.8066 0.1387 119.0526 93.4105 94.1262 364.6654 82.5425 0.0179 387.2741 41.1594 148.0534 564.3564 1.3539 16.5016 2.3024 238.2148 73.4035 50.6820 323.1096 51.2423 444.8578 4.4551 88.5537 19.4563 2.6735 37.7611 15.7907 1722.4351 18.7249 124.7043 135.5032 24.5443 7.5900 339.9086 11.0372 314.5446 11.5769 116.3663 26.3984 28.4956 0.8108 8.8025 4.8395 4.8138 16.4810 14.3790 40.6947 0.3010 48.6330 46.8378 4.2670 11.7762 21.0188 23.6471
temp: 298.150 k
press: 1.00000 atm
elementType: 16 16 8 8 8 8 8 8 8 8 8 7 7 6 6 6 6 6 6 6 6 6 6 6 6 6 6 6 6 6 6 6 6 6 1 1 1 1 1 1 1 1 1 1 1 1 1 1 1 1
symmnumber: 1
zpe: 889089.8 jmol-1
zpe.correction: 0.338636 hartree
zpe.thermalcorrener: 0.371840 hartree
zpe.thermalcorrenthalpy: 0.372784 hartree
zpe.thermalcorrgfe: 0.270067 hartree
zpe.sumelectzpe: -2389.745098 hartree
zpe.sumelectthermal: -2389.711894 hartree
zpe.sumelectthermalent: -2389.710950 hartree
zpe.sumelectthermalfe: -2389.813667 hartree
dipole: -0.0087 4.6380 -0.0047
dipole: 4.6380
quadrupole: -357.4082 -205.3257 -220.5027
quadrupole: -0.4131 31.4825 -0.1180
quadrupole: -96.3293 55.7532 40.5762 -0.4131 31.4825 -0.1180
hfenergy: -2390.0837343 hartree
pointgroup: C01 [X(C21H16N2O9S2)]
dipole: 0.0038173 1.8246046 -0.0219516 debye
polarizability: 770.1863333|0.0663478|320.1600183|7.8015416|-2.1119304|160.904273 unknown
InChI: InChI=1S/C21H16N2O9S2/c24-19-9-15(33(27,28)29)5-11-1-3-13(7-17(11)19)22-21(26)23-14-4-2-12-6-16(34(30,31)32)10-20(25)18(12)8-14/h1-10,22-25,27,30H
charge 0 multiplicity 1
50 atoms
S  9.397441 -0.604014 0.023882
S  -9.397739 -0.598611 -0.047498
O  5.701759 3.020413 -0.279075
O  -5.700486 3.030317 0.16169
O  9.596078 -0.397585 1.861037
O  -9.586483 -0.47263 -1.893069
O  9.548819 -2.171567 -0.346301
O  10.319493 0.506717 -0.70767
O  -9.554045 -2.148892 0.387808
O  -10.32089 0.543933 0.631759
O  -0.000392 -1.582596 0.007554
N  1.166213 0.469531 -0.046565
N  -1.165788 0.470983 0.012192
C  4.904429 0.661657 -0.107756
C  -4.904072 0.667241 0.057935
C  5.271147 -0.738586 -0.039811
C  -5.271611 -0.734104 0.026769
C  2.516544 0.029709 -0.059321
C  -2.51648 0.032539 0.032719
C  3.52152 1.013852 -0.099154
C  -3.520828 1.018049 0.043961
C  7.597367 -0.109284 -0.027374
C  -7.597418 -0.103917 -0.007653
C  6.64841 -1.120337 0.007238
C  -6.649019 -1.116128 -0.012442
C  5.961172 1.646715 -0.179284
C  -5.96032 1.654531 0.099386
C  4.22406 -1.715409 -0.004759
C  -4.225151 -1.712219 0.01984
C  7.304713 1.271504 -0.125344
C  -7.304005 1.278842 0.052269
C  2.878793 -1.360425 -0.019762
C  -2.879668 -1.357921 0.028534
C  -0.000029 -0.32085 -0.007494
H  3.21877 2.071154 -0.094465
H  -3.217071 2.074614 0.012425
H  6.942787 -2.173064 0.059717
H  -6.943832 -2.169775 -0.03579
H  4.499087 -2.774975 0.038442
H  -4.50088 -2.772367 0.004088
H  8.094457 2.024274 -0.190215
H  -8.09352 2.033515 0.093892
H  2.090801 -2.113524 0.00673
H  -2.092202 -2.112011 0.023219
H  1.050362 1.485113 -0.071212
H  -1.049243 1.486784 0.012561
H  4.780058 3.201665 -0.587078
H  -4.778558 3.219809 0.463937
H  10.564748 -0.536384 2.074941
H  -10.552999 -0.626483 -2.10643
