program: Gaussian 09
title: 000235611
version: EM64L-G09RevD.01
frameworkgroup: C1[X(C20H14O)]
method: RPBEPBE
basis: SDD
operation: Freq
keyword: #pfreq=noraman
keyword: PBEPBE/SDD
title: #p freq=noraman PBEPBE/SDD
converged: YES YES NO NO
title: Mulliken charges:
elementType: O C C C C C C C C C C C C C C C C C C C C H H H H H H H H H H H H H H
charge: -0.328443 0.155645 0.155643 0.232633 0.232632 0.424769 0.424767 -0.397036 -0.397039 -0.375297 -0.375295 -0.459059 -0.459058 -0.421391 -0.421391 -0.221968 -0.221964 -0.238559 -0.238561 -0.238606 -0.238605 0.270549 0.270549 0.270003 0.270005 0.239203 0.239203 0.237910 0.237910 0.228179 0.228179 0.229393 0.229393 0.227853 0.227854
chargesum: 0.00000
title: Mulliken charges with hydrogens summed into heavy atoms:
elementType: O C C C C C C C C C C C C C C C C C C C C
charge: -0.328443 0.155645 0.155643 0.232633 0.232632 0.424769 0.424767 -0.126488 -0.126490 -0.105294 -0.105290 -0.219856 -0.219855 -0.183481 -0.183480 0.006211 0.006215 -0.009166 -0.009168 -0.010752 -0.010751
polarizability: 3.29431263e+02 -3.24846986e-03 2.28628289e+02 -7.71180683e+00 5.83447214e-04 1.35275509e+02
1716.lowfreq: -11.0808 -3.9754 -3.5468 -0.0007 0.0001 0.0006 19.3708 23.5610 60.3200
frequency: 18.7615 23.4087 60.3190 127.4202 127.6749 174.3406 174.4017 184.1849 223.7000 257.7566 283.1910 395.3167 414.6812 420.4309 430.8696 467.6515 469.9117 487.4643 492.8254 517.7762 523.6197 558.0688 563.7405 586.7289 616.2156 632.2070 652.2989 711.6424 714.2147 742.8776 747.8667 779.1945 781.6604 783.8493 789.2722 807.6219 812.3988 838.0815 873.1319 882.1946 884.4494 900.5763 911.3985 963.5546 966.6830 977.3838 978.8774 995.9970 996.4929 1002.0173 1019.5130 1025.0335 1051.3994 1076.3094 1085.3443 1145.7837 1146.5739 1169.8028 1170.2964 1177.1465 1181.0680 1224.7194 1225.9845 1238.0892 1239.2656 1263.6557 1265.9861 1365.8133 1379.0571 1400.7710 1404.6065 1423.3243 1423.3605 1436.6126 1443.6012 1450.4966 1453.1088 1511.1728 1518.4058 1577.7597 1585.0306 1594.9881 1596.1035 1634.5288 1638.9185 3122.8118 3122.8231 3129.4028 3129.5557 3137.2349 3137.2695 3148.9480 3150.2059 3155.4194 3155.5892 3166.8178 3168.7231 3172.8681 3172.9315
redmass: 5.5460 5.1220 4.6144 4.4544 4.5466 4.0871 5.4700 4.3084 4.5412 4.2386 5.9085 4.5916 3.2354 3.3256 4.3969 3.2856 3.3395 6.3212 7.4417 6.8829 6.9216 3.7602 3.3701 7.6649 4.2295 3.3696 4.5559 5.0257 5.6145 1.3319 1.4033 2.1153 2.6300 4.1400 2.8734 1.6623 1.6566 4.8615 1.4801 1.5654 4.9346 1.5312 1.4298 1.3382 1.3459 1.3808 1.3714 1.3305 1.3343 5.5552 2.6910 2.2710 2.4668 2.0361 2.3980 1.4507 1.4370 1.1078 1.0889 1.1813 1.2587 1.8650 2.0634 2.0354 2.3794 1.6975 1.7321 2.2895 2.1427 3.1378 3.6881 4.8012 4.7088 2.7724 2.5368 2.5078 2.6346 3.8118 4.0616 7.4322 7.6014 5.5470 5.6413 6.8983 7.2021 1.0861 1.0861 1.0864 1.0865 1.0901 1.0901 1.0932 1.0935 1.0958 1.0957 1.0979 1.0970 1.0978 1.0979
irintensity: 1.2580 0.0681 0.1055 0.4383 0.0005 5.3630 0.0782 1.1488 3.1208 1.4656 15.4608 0.8437 13.4731 2.9033 0.3586 2.5334 0.0565 0.0466 1.3315 0.2197 0.0337 1.3451 19.4451 4.4716 2.3804 6.8575 3.6156 2.1055 14.2468 0.1707 0.0745 79.5108 17.4467 18.5735 13.2304 124.9056 34.9692 0.0751 3.1539 1.9513 16.3020 4.3562 0.4088 0.2083 0.1119 7.3615 2.0441 0.0089 0.0054 0.2473 44.1144 10.7672 76.0439 11.8793 113.8134 0.7396 30.9374 0.2869 6.0302 0.0116 42.5111 0.2573 220.0160 4.1366 154.2854 38.4743 3.1970 135.1601 2.8970 79.8320 0.2866 0.7087 32.5229 46.2105 2.1340 74.5305 0.2578 53.5115 16.1304 117.0265 6.2120 10.6555 7.4857 2.8801 3.8162 1.0476 1.2555 0.8569 0.6831 20.2436 9.1117 33.6142 27.3961 64.0940 4.3302 8.0734 15.4190 9.7564 17.1530
temp: 298.150 k
press: 1.00000 atm
elementType: 8 6 6 6 6 6 6 6 6 6 6 6 6 6 6 6 6 6 6 6 6 1 1 1 1 1 1 1 1 1 1 1 1 1 1
symmnumber: 1
zpe: 719796.8 jmol-1
zpe.correction: 0.274156 hartree
zpe.thermalcorrener: 0.289678 hartree
zpe.thermalcorrenthalpy: 0.290622 hartree
zpe.thermalcorrgfe: 0.229790 hartree
zpe.sumelectzpe: -844.358775 hartree
zpe.sumelectthermal: -844.343254 hartree
zpe.sumelectthermalent: -844.342309 hartree
zpe.sumelectthermalfe: -844.403141 hartree
dipole: -0.0001 0.7727 0.0002
dipole: 0.7727
quadrupole: -101.5771 -110.1129 -123.7486
quadrupole: -0.0007 0.2299 0.0001
quadrupole: 10.2358 1.7000 -11.9358 -0.0007 0.2299 0.0001
hfenergy: -844.6329314 hartree
pointgroup: C01 [X(C20H14O1)]
dipole: 0.0000056 0.0002675 0.3040154 debye
polarizability: 329.5844404|-5.4504515|135.1223675|0.0214747|0.0606991|228.6282526 unknown
InChI: InChI=1S/C20H14O/c1-3-11-17-15(7-1)9-5-13-19(17)21-20-14-6-10-16-8-2-4-12-18(16)20/h1-14H
charge 0 multiplicity 1
35 atoms
O  -0.000241 -0.000207 -0.236843
C  -2.407744 0.102215 -0.231707
C  2.407264 -0.102427 -0.230927
C  -1.175112 0.396893 0.44782
C  1.174478 -0.39629 0.448672
C  -3.64289 0.567654 0.36597
C  3.642298 -0.566917 0.367717
C  -1.150569 1.111687 1.648052
C  1.149679 -1.109425 1.649885
C  -2.449372 -0.62536 -1.465275
C  2.449146 0.623489 -1.465463
C  -3.601065 1.291908 1.603393
C  3.600208 -1.289495 1.606111
C  -4.878471 0.285295 -0.306149
C  4.878033 -0.285319 -0.304441
C  -2.379291 1.555476 2.226056
C  2.378292 -1.552321 2.228811
C  -3.671169 -0.883848 -2.091637
C  3.671086 0.881284 -2.091831
C  -4.895102 -0.423511 -1.509303
C  4.894913 0.421878 -1.508538
H  -0.198764 1.341089 2.135916
H  0.197766 -1.33821 2.137827
H  -1.508065 -0.971223 -1.901646
H  1.507918 0.968653 -1.902555
H  -4.539756 1.638522 2.050099
H  4.538811 -1.635416 2.053539
H  -5.81447 0.637975 0.143151
H  5.813949 -0.637282 0.145592
H  -2.348176 2.116998 3.165931
H  2.346979 -2.112555 3.169448
H  -3.696685 -1.442156 -3.033787
H  3.696799 1.438329 -3.034723
H  -5.845886 -0.631666 -2.012358
H  5.845811 0.629479 -2.011605
