program: Gaussian 09
title: 000020618
version: EM64L-G09RevD.01
frameworkgroup: C1[X(C7H13N)]
method: RPBEPBE
basis: SDD
operation: Freq
keyword: #pfreq=noraman
keyword: PBEPBE/SDD
title: #p freq=noraman PBEPBE/SDD
converged: YES YES NO NO
title: Mulliken charges:
elementType: N C C C C C C C H H H H H H H H H H H H H
charge: -0.067334 -0.171209 -0.158102 -0.494041 -0.453739 -0.440766 -0.418904 -0.651700 0.234252 0.238097 0.227473 0.219542 0.209746 0.227307 0.205153 0.233171 0.219235 0.199310 0.228447 0.183198 0.230864
chargesum: 0.00000
title: Mulliken charges with hydrogens summed into heavy atoms:
elementType: N C C C C C C C
charge: -0.067334 0.063044 0.079994 -0.047026 -0.016686 -0.002442 -0.000358 -0.009191
polarizability: 8.37429140e+01 6.04486864e-01 7.41807871e+01 7.07752585e-01 -1.14895361e+00 6.94705306e+01
1716.lowfreq: -31.0594 -0.0002 0.0005 0.0007 13.0077 28.3418 109.5999 206.8669 250.0492
frequency: 109.5393 206.8474 250.0470 312.3430 385.5853 397.3949 460.6130 544.6503 690.7687 754.9655 777.4282 809.2663 835.8003 882.6022 926.0718 933.3144 942.4341 951.0025 957.0975 990.7795 1034.0765 1063.9788 1103.5935 1106.9023 1112.9749 1135.7178 1136.8776 1179.6686 1195.2803 1221.2486 1232.8476 1252.7239 1276.3414 1286.7192 1296.5101 1307.5974 1327.1367 1431.8909 1450.6778 1460.4374 1468.4243 1474.1067 1476.4892 1490.5273 2846.6289 2938.2671 2997.4564 3007.9100 3013.1744 3016.6178 3018.1765 3059.1214 3067.4217 3073.5970 3078.7582 3080.7315 3092.1934
redmass: 2.4178 1.1076 1.8145 2.2006 1.9188 2.3572 2.0591 4.1533 3.9240 2.7446 3.8877 1.6757 2.2063 2.3890 3.3165 1.9547 1.7978 1.5545 1.9137 2.0597 1.4846 1.5331 1.2293 1.1329 1.2468 1.3900 2.7135 1.9318 1.7942 1.3590 1.5365 1.3954 1.6765 1.4053 1.7026 1.4983 1.4572 1.1571 1.0857 1.0850 1.0656 1.0870 1.0511 1.0905 1.0566 1.0655 1.0599 1.0590 1.0636 1.0768 1.0934 1.1029 1.0901 1.0985 1.1062 1.0938 1.1031
irintensity: 0.8818 0.5919 2.3335 1.4419 1.7023 1.9507 1.6985 6.8234 4.8370 0.0375 5.8659 7.3815 1.3622 4.3403 7.8894 4.8573 1.4188 3.4554 0.9458 16.8135 5.1657 7.4861 5.2619 1.5661 3.1943 7.3321 12.4282 10.1354 10.8287 2.3106 4.6379 1.6645 0.0819 2.9516 11.9340 1.3639 5.0904 0.9420 5.7026 10.4019 24.4268 5.4320 5.4810 3.8996 132.4205 78.2967 33.1788 44.9862 54.0530 43.5959 58.2840 18.3156 51.5141 45.3775 35.4183 22.6168 53.3078
temp: 298.150 k
press: 1.00000 atm
elementType: 7 6 6 6 6 6 6 6 1 1 1 1 1 1 1 1 1 1 1 1 1
symmnumber: 1
zpe: 496039.7 jmol-1
zpe.correction: 0.188932 hartree
zpe.thermalcorrener: 0.196122 hartree
zpe.thermalcorrenthalpy: 0.197067 hartree
zpe.thermalcorrgfe: 0.157940 hartree
zpe.sumelectzpe: -328.618879 hartree
zpe.sumelectthermal: -328.611689 hartree
zpe.sumelectthermalent: -328.610744 hartree
zpe.sumelectthermalfe: -328.649871 hartree
dipole: -0.0819 0.3864 1.0716
dipole: 1.1421
quadrupole: -48.6696 -49.0343 -51.9556
quadrupole: 0.3007 0.7583 -1.2048
quadrupole: 1.2169 0.8522 -2.0691 0.3007 0.7583 -1.2048
hfenergy: -328.807811 hartree
pointgroup: C01 [X(C7H13N1)]
dipole: -0.041563 0.168584 0.4144189 debye
dipolederiv: -0.6510675 -0.0089993 -0.0554957 -0.0042284 -0.4405115 0.0012693 0.1313283 -0.1170285 -0.4897861 0.0665512 -0.0026176 0.0058059 -0.0193083 0.1103273 0.0537837 0.0144164 0.0276581 0.0459916 0.3534205 0.0949007 -0.0760134 0.1336878 0.2709538 0.0061821 -0.1361104 0.0284352 0.2630004 0.0015306 0.0421741 0.0079456 0.0704697 -0.082641 -0.0524383 0.0426224 -0.0004311 -0.0854263 0.0887102 -0.0291345 -0.0395204 -0.0124817 -0.0262717 -0.0246275 -0.0507874 -0.0418737 0.1018014 -0.0494795 0.040767 -0.0625971 0.0124942 0.0532953 -0.04044 -0.0767772 -0.0403297 0.0484801 0.0842156 -0.041548 0.0859678 -0.0603986 0.3822144 -0.054925 0.0812017 -0.0181548 0.2657986 0.4926279 -0.0223396 0.1014901 -0.0294426 0.1295701 0.0724335 0.1103231 0.0953891 0.311579 0.0060481 0.0824848 0.016479 0.0876341 -0.1506948 -0.0623376 0.0264798 -0.0662931 0.0566437 -0.0207561 0.1132295 -0.0445777 0.0850214 -0.1029286 0.0636495 -0.0294167 0.0608367 0.0382804 -0.046812 -0.0677306 -0.1545387 -0.0639488 0.0257932 -0.0759293 -0.1063526 -0.046074 -0.0351617 -0.0885044 -0.0648232 0.1475656 -0.0487934 0.0570075 0.0618873 0.1098552 0.0455533 -0.0212288 0.061019 0.0068477 -0.010456 0.0331697 0.0232547 0.0737058 -0.076555 0.0842152 -0.1559049 -0.1862114 0.0150643 0.056495 -0.0087444 0.0470004 0.0039454 0.1175238 -0.0056212 0.0386216 -0.0630694 -0.1239015 0.0485569 -0.0977322 -0.0825373 0.05389 0.0724541 0.102862 0.0328648 0.0765011 0.0423369 0.0422958 0.0249298 0.0153126 -0.0621317 0.0193664 -0.1102213 -0.1028591 0.0363187 0.0421709 -0.0413837 0.0310514 -0.015608 0.0649685 -0.0250344 0.1392789 -0.1624603 -0.0689479 -0.1362795 -0.0654539 -0.0776826 -0.1189197 -0.0274369 -0.085972 -0.1191265 0.0125395 0.0300925 0.0640348 -0.0035027 0.145931 -0.1401195 -0.0042291 -0.0437259 0.0025819 0.0888847 -0.0752291 0.0157506 -0.0294495 -0.0650801 0.0116267 -0.1337634 -0.1977773 -0.1005624 -0.232695 -0.0469581 -0.0623875 0.0703869 -0.1365481 0.0338761 0.0825437 0.1029377 0.0789058 -0.0189634 unknown
polarizability: 83.7014504|0.7171082|74.0893625|0.975057|-1.3152874|69.6034188 unknown
InChI: InChI=1S/C7H13N/c1-8-5-6-2-3-7(8)4-6/h6-7H,2-5H2,1H3
charge 0 multiplicity 1
21 atoms
N  1.078535 -0.173933 -0.46842
C  -0.853244 1.071987 0.284116
C  0.119424 -0.962007 0.389505
C  -0.41031 0.09223 1.410792
C  -1.82421 0.180328 -0.549565
C  -1.145162 -1.238653 -0.471822
C  0.479408 1.2163 -0.51285
C  2.482727 -0.203085 -0.013095
H  -1.277598 2.037072 0.60463
H  0.604753 -1.863777 0.794874
H  0.380039 0.501746 2.065475
H  -1.251223 -0.268807 2.028867
H  -1.919715 0.543661 -1.588208
H  -2.834244 0.172287 -0.100518
H  -1.802904 -1.980514 0.01776
H  -0.853594 -1.623862 -1.462424
H  0.309585 1.54241 -1.556101
H  1.149451 1.954622 -0.020313
H  2.853837 -1.243667 -0.01844
H  2.64763 0.220654 1.010955
H  3.105916 0.377407 -0.717318
