program: Gaussian 09
title: 000235603
version: EM64L-G09RevD.01
frameworkgroup: C1[X(C19H13N3O4S2)]
method: RPBEPBE
basis: SDD
operation: Freq
keyword: #p
keyword: freq=noraman
keyword: PBEPBE/SDD
title: #p freq=noraman PBEPBE/SDD
converged: YES YES NO NO
title: Mulliken charges:
elementType: S S O O O O N N N C C C C C C C C C C C C C C C C C C C H H H H H H H H H H H H H
charge: 0.328491 0.138951 -0.187446 -0.180616 -0.198787 -0.193750 -0.199433 0.002444 0.020760 0.348642 0.390755 -0.613079 -0.347704 -0.337278 -0.330096 -0.322105 -0.343208 0.481923 -0.098604 -0.488026 0.435160 -0.202275 -0.205842 -0.202521 -0.209122 -0.400617 -0.230149 -0.235558 0.252134 0.262656 0.274173 0.252982 0.292360 0.332347 0.295259 0.235744 0.234074 0.239551 0.234017 0.238209 0.235581
chargesum: 0.00000
title: Mulliken charges with hydrogens summed into heavy atoms:
elementType: S S O O O O N N N C C C C C C C C C C C C C C C C C C C
charge: 0.328491 0.138951 -0.187446 -0.180616 -0.198787 -0.193750 -0.199433 0.002444 0.020760 0.348642 0.390755 -0.613079 -0.347704 -0.085144 -0.067440 -0.047932 -0.090226 0.481923 0.193756 -0.155678 0.435160 0.033469 0.028232 0.037031 0.024895 -0.105358 0.008060 0.000023
polarizability: 4.45468239e+02 1.08509662e+01 3.21117930e+02 9.10681578e+00 -2.06084344e+01 1.85162532e+02
1716.lowfreq: -5.0288 -3.1676 -0.0021 -0.0020 -0.0014 5.0630 14.4648 17.1008 26.1752
frequency: 13.7733 16.8669 26.0115 33.9787 43.7391 52.8656 55.6664 65.2149 71.5764 91.6743 106.7341 127.2593 137.0120 161.4426 169.0133 193.3034 236.2554 253.0562 267.9250 287.2299 291.9165 309.7803 329.9624 352.2518 387.8955 406.2892 409.3313 426.7978 438.4842 470.1257 480.2606 493.2261 507.9867 520.5093 564.4203 584.5741 591.4161 609.8688 622.0788 635.7753 648.5374 660.2554 692.3304 694.3165 699.6908 711.5020 730.1228 737.6734 755.5822 762.1873 777.6480 836.6262 839.9469 850.0292 867.2020 875.4301 921.3605 926.0648 948.8985 973.9789 975.4655 981.9763 984.3802 989.3231 989.8590 996.8193 1002.6451 1022.6164 1024.8379 1030.6679 1080.4778 1083.6426 1086.3330 1118.5646 1143.4894 1158.0812 1174.2524 1175.0904 1181.6149 1186.4902 1201.5448 1214.1928 1239.8010 1250.4320 1306.6557 1312.9305 1343.0681 1355.4212 1367.3219 1378.3828 1384.7574 1391.5095 1411.1803 1438.4514 1440.9070 1443.6654 1474.3855 1477.2154 1573.4317 1592.1545 1592.3992 1596.8844 1600.6466 1605.8398 3134.7985 3136.7321 3143.3996 3144.1356 3153.5928 3156.5817 3162.6854 3166.0067 3175.0267 3175.7174 3179.2428 3189.4947 3196.2844
redmass: 9.8583 8.1663 7.5488 4.4664 5.5076 8.4763 10.4590 5.3364 6.4080 15.1752 6.1637 11.1956 10.5254 5.8996 9.4468 10.0776 5.5877 4.6676 10.2846 8.2551 5.4958 7.7540 13.1859 13.3693 9.2236 2.8363 2.8629 6.3147 5.2275 5.7002 4.1709 4.8826 7.1559 6.8535 7.0019 6.3887 5.9016 6.3631 6.4334 6.2741 7.8686 7.8825 9.5795 2.0890 1.8618 4.9894 4.4884 5.8108 12.0245 1.6466 2.1592 1.3948 1.2559 1.2499 8.5111 5.5171 1.4672 1.4913 1.4918 1.3965 3.3266 1.4085 1.6419 5.9593 5.4740 1.3452 1.3440 2.2959 2.6661 3.1015 1.5433 1.5446 1.7173 7.4458 1.4426 2.8257 1.0533 1.0576 1.1168 1.2044 11.2416 8.0086 4.6872 1.4547 1.5149 1.3534 4.4928 5.0404 10.5273 9.0254 9.9032 9.1837 7.2512 2.2165 2.2861 2.5693 2.2808 2.2690 8.7013 6.9644 6.6048 6.4946 6.1303 6.1441 1.0852 1.0854 1.0886 1.0888 1.0929 1.0931 1.0972 1.0967 1.1018 1.1011 1.0890 1.0923 1.0970
irintensity: 0.3494 0.5175 0.1561 0.5927 0.2565 0.3785 0.3574 0.1756 0.9006 1.4827 0.7719 4.1890 3.3485 0.6435 5.8446 0.6152 6.8776 1.6396 2.1744 0.5295 0.6102 1.1085 0.1520 1.3141 10.3490 1.1518 0.4141 14.4190 0.5767 8.4711 10.3510 0.3500 5.7870 6.0027 13.3614 4.4261 94.6336 0.1287 2.1558 37.0730 8.9783 10.6934 18.7128 36.3765 78.3180 9.7188 35.7229 3.3119 15.7943 45.9578 17.7860 13.1434 0.6879 0.1294 28.5037 9.3851 3.2788 5.6340 25.7228 0.6635 118.3103 2.5007 16.9601 6.9178 4.1396 0.9102 3.9545 15.7854 37.2073 22.9185 9.0176 11.0900 18.8690 11.1109 14.4145 4.2237 0.0049 0.1934 0.9926 4.1575 349.1742 340.4945 47.5731 41.7793 68.7866 10.8957 359.6044 56.8706 98.0869 3.0727 1.4143 87.6229 23.7957 7.4827 9.6276 40.3727 50.7585 52.0358 28.8911 48.2581 30.6111 4.9287 11.2401 5.4498 0.7302 1.0185 0.8390 7.6229 17.5829 21.3824 13.2609 19.4602 15.6442 9.5835 2.0584 22.4625 4.5343
temp: 298.150 k
press: 1.00000 atm
elementType: 16 16 8 8 8 8 7 7 7 6 6 6 6 6 6 6 6 6 6 6 6 6 6 6 6 6 6 6 1 1 1 1 1 1 1 1 1 1 1 1 1
symmnumber: 1
zpe: 743158.7 jmol-1
zpe.correction: 0.283054 hartree
zpe.thermalcorrener: 0.307700 hartree
zpe.thermalcorrenthalpy: 0.308644 hartree
zpe.thermalcorrgfe: 0.223946 hartree
zpe.sumelectzpe: -1990.961416 hartree
zpe.sumelectthermal: -1990.936771 hartree
zpe.sumelectthermalent: -1990.935826 hartree
zpe.sumelectthermalfe: -1991.020524 hartree
dipole: 9.6858 -0.1223 3.0506
dipole: 10.1556
quadrupole: -192.1625 -174.0035 -171.5527
quadrupole: -1.6482 -2.9197 0.6675
quadrupole: -12.9229 5.2360 7.6869 -1.6482 -2.9197 0.6675
hfenergy: -1991.2444705 hartree
pointgroup: C01 [X(C19H13N3O4S2)]
dipole: -3.8458075 -0.6569524 -0.8615329 debye
polarizability: 445.2757271|8.3488498|322.6833119|-15.1063661|12.7508155|183.7896618 unknown
InChI: InChI=1S/C19H13N3O4S2/c23-21(24)16-11-12-18(17(13-16)22(25)26)28-19(27)20(14-7-3-1-4-8-14)15-9-5-2-6-10-15/h1-13H
charge 0 multiplicity 1
41 atoms
S  0.153876 1.001983 -0.268719
S  0.187362 -1.879765 1.089712
O  3.650012 3.191654 1.275548
O  1.626634 3.291395 0.218168
O  6.241632 -1.809059 -1.566335
O  6.934182 0.156053 -0.631496
N  -2.032979 -0.550138 0.166618
N  2.73547 2.694831 0.513237
N  6.015005 -0.661238 -1.020143
C  -2.712395 0.672049 -0.263701
C  -2.907469 -1.678161 0.481229
C  -0.662269 -0.625903 0.340784
C  1.899083 0.506087 -0.470809
C  -3.375643 0.691467 -1.512316
C  -2.713093 -2.928549 -0.150497
C  -2.746046 1.79885 0.591815
C  -3.979599 -1.486798 1.382396
C  2.972759 1.357441 -0.077066
C  2.23401 -0.736062 -1.072479
C  4.321979 0.979577 -0.231686
C  4.599787 -0.259274 -0.828376
C  -4.062721 1.856873 -1.914254
C  -3.594586 -3.993327 0.13116
C  -3.430075 2.962946 0.178208
C  -4.856987 -2.558569 1.658698
C  3.569541 -1.122909 -1.263448
C  -4.088559 2.994513 -1.07264
C  -4.667084 -3.813383 1.036665
H  -3.348259 -0.19455 -2.154912
H  -1.87852 -3.066066 -0.843877
H  -2.234622 1.765226 1.559518
H  -4.125232 -0.513307 1.860985
H  1.432582 -1.396883 -1.407179
H  5.124622 1.641581 0.10248
H  3.826498 -2.070314 -1.74326
H  -4.572515 1.878723 -2.883206
H  -3.444544 -4.962317 -0.35669
H  -3.447949 3.840653 0.832469
H  -5.68451 -2.412026 2.36091
H  -4.618673 3.898793 -1.389816
H  -5.347704 -4.643494 1.253805
