program: Gaussian 09
title: 000235595
version: EM64L-G09RevD.01
frameworkgroup: C1[X(C17H14N2O5S)]
method: RPBEPBE
basis: SDD
operation: Freq
keyword: #p
keyword: freq=noraman
keyword: PBEPBE/SDD
title: #p freq=noraman PBEPBE/SDD
converged: YES YES NO NO
title: Mulliken charges:
elementType: S O O O O O N N C C C C C C C C C C C C C C C C C H H H H H H H H H H H H H H
charge: 0.983313 -0.412978 -0.567737 -0.505322 -0.503959 -0.268191 -0.489301 -0.683349 0.313365 0.439369 -0.059178 -0.456133 -0.610411 0.519155 0.151784 -0.441963 -0.392615 -0.371190 0.138513 0.258915 -0.329162 -0.321358 0.507162 -0.413733 -0.431753 0.294596 0.176597 0.252027 0.304744 0.322211 0.305296 0.359464 0.272762 0.199916 0.226048 0.223247 0.380227 0.313797 0.315823
chargesum: 0.00000
title: Mulliken charges with hydrogens summed into heavy atoms:
elementType: S O O O O O N N C C C C C C C C C C C C C C C C C
charge: 0.983313 -0.053514 -0.187511 -0.505322 -0.503959 -0.268191 -0.184005 -0.053730 0.313365 0.439369 -0.059178 -0.161537 -0.433814 0.519155 0.151784 -0.189936 -0.087871 -0.048979 0.138513 0.258915 -0.056400 -0.121442 0.507162 -0.187685 -0.208506
polarizability: 5.48274732e+02 -2.62722773e+00 2.41963967e+02 -3.61755284e+00 -4.18181108e+00 1.15211173e+02
1716.lowfreq: -31.3505 -4.7677 -0.0009 -0.0008 0.0014 1.2708 7.3808 26.0555 27.4120
frequency: -31.3223 26.0139 27.3771 33.3980 41.4260 61.3105 82.8290 96.3098 112.6296 149.0295 152.8232 164.8488 179.6264 184.6256 221.4770 229.7316 238.4399 258.8826 273.9889 294.6540 322.9348 327.8914 358.0085 371.6508 397.1521 408.9462 414.1047 420.2202 425.5264 429.6232 439.6117 496.5268 503.6270 511.7303 530.9009 535.4226 542.7970 569.6152 594.7287 623.6330 626.2739 636.0184 675.2455 687.0265 721.2396 755.8017 762.3716 776.0725 809.6109 818.0822 830.5731 841.3107 843.8220 847.3617 851.8288 877.3140 879.6814 913.3516 915.9723 937.1864 968.5824 985.7745 997.4013 1010.3286 1021.2583 1046.3992 1049.4579 1076.6162 1087.0508 1132.1454 1137.2460 1161.6016 1193.9810 1218.7010 1247.0078 1253.9938 1277.9439 1297.9090 1314.7346 1330.7006 1333.4842 1385.3043 1394.7008 1417.6682 1432.5880 1447.4270 1454.4536 1492.4750 1519.5671 1535.3651 1563.8344 1591.3730 1600.4273 1607.4898 1631.2680 1638.3141 1649.3010 3076.3241 3107.0594 3128.8283 3137.7839 3143.3222 3160.5500 3163.5510 3180.1195 3197.3856 3479.7128 3533.2276 3560.0014 3597.4544 3698.9409
redmass: 2.0055 4.9941 4.7995 5.1481 6.6620 4.7774 5.7693 7.2271 5.4982 4.0284 5.2762 1.9028 4.0801 3.3651 5.6777 4.9286 8.1050 3.5733 5.8382 5.5063 10.2852 9.0376 7.2530 3.3726 4.7456 1.8529 1.2788 9.7419 2.9310 1.3147 4.5946 4.8773 5.9560 3.5219 6.4289 4.9675 3.4812 6.4840 4.3892 3.1696 2.1657 3.9976 3.5652 3.3988 6.2545 4.3711 2.2840 6.1007 1.4526 5.3451 6.8717 1.8145 1.9141 1.5750 4.4906 3.0066 2.0607 1.6590 5.4808 1.4146 16.9429 1.3797 2.8530 1.3290 1.4416 2.3104 1.3016 2.5539 2.7906 1.2894 1.2348 1.3339 1.1329 1.3984 1.6956 2.8087 2.2206 2.2449 1.5145 2.5785 2.5444 4.1841 3.7655 3.1973 8.1500 4.1819 3.3235 2.9112 3.1155 3.5807 5.4745 8.6119 6.4655 4.2630 4.1568 4.0054 1.4741 1.0893 1.0869 1.0896 1.0955 1.0913 1.0928 1.0953 1.0928 1.0953 1.0661 1.0755 1.0453 1.0657 1.1040
irintensity: 33.2215 1.4672 8.9612 7.8399 0.7779 1.0019 14.2664 2.5586 2.8582 18.7847 15.2023 36.3300 23.9901 16.6725 18.2150 0.5924 14.9762 33.6316 4.0702 0.6613 22.6143 27.6070 19.6362 4.2897 2.3239 2.2146 4.9865 74.8266 6.9244 305.1124 42.6760 6.5605 15.6195 0.9992 169.6605 12.1472 24.7143 57.5282 30.4954 15.7222 47.9359 6.4565 25.6316 17.2477 11.5233 17.7215 4.4181 8.5593 21.7643 1.7597 73.2990 32.1484 49.4804 33.8189 40.2030 31.9010 14.8345 62.1346 16.0357 0.4705 69.1299 3.7599 1.7665 0.9986 3.2732 13.3392 100.2694 120.6702 35.2587 190.0950 44.2232 0.0581 222.3285 25.6794 128.6104 396.0532 13.3518 80.6059 59.4727 332.1215 42.0836 10.0811 313.6331 15.7267 13.2717 1.1897 23.7929 764.3139 8.2417 101.1775 28.1078 13.2064 105.4435 313.2997 310.0952 105.1265 295.0779 28.4220 26.7390 22.1838 18.9012 6.2896 3.9576 7.4593 13.5765 20.2235 42.9755 10.2712 162.1744 22.0297 25.1016
temp: 298.150 k
press: 1.00000 atm
elementType: 16 8 8 8 8 8 7 7 6 6 6 6 6 6 6 6 6 6 6 6 6 6 6 6 6 1 1 1 1 1 1 1 1 1 1 1 1 1 1
symmnumber: 1
zpe: 734078.6 jmol-1
zpe.correction: 0.279596 hartree
zpe.thermalcorrener: 0.302394 hartree
zpe.thermalcorrenthalpy: 0.303338 hartree
zpe.thermalcorrgfe: 0.226269 hartree
zpe.sumelectzpe: -1537.986649 hartree
zpe.sumelectthermal: -1537.963851 hartree
zpe.sumelectthermalent: -1537.962907 hartree
zpe.sumelectthermalfe: -1538.039976 hartree
dipole: -12.4351 3.9557 1.5059
dipole: 13.1357
quadrupole: -116.5477 -150.3394 -161.5543
quadrupole: -24.7241 12.7706 -2.3873
quadrupole: 26.2661 -7.5256 -18.7405 -24.7241 12.7706 -2.3873
hfenergy: -1538.2662451 hartree
pointgroup: C01 [X(C17H14N2O5S1)]
dipole: -4.8636707 -1.6462383 -0.5852732 debye
polarizability: 548.0747613|7.8750578|242.0176231|4.7826287|-5.6880155|115.357488 unknown
InChI: InChI=1S/C17H14N2O5S/c18-12-4-1-10(2-5-12)17(21)19-13-6-3-11-7-14(25(22,23)24)9-16(20)15(11)8-13/h1-9,19-20,22H,18H2
charge 0 multiplicity 1
39 atoms
S  6.388211 0.254163 0.189819
O  2.349639 -2.958783 -0.21851
O  6.685519 0.327994 -1.647131
O  6.680386 1.717295 0.816335
O  7.151313 -1.051907 0.766063
O  -2.84125 2.224836 -0.086871
N  -1.905249 0.067768 -0.073841
N  -8.305684 -1.228447 0.033586
C  1.790953 -0.529441 -0.043672
C  2.302105 0.821664 0.081569
C  4.550454 -0.045057 0.083157
C  3.710666 1.057784 0.141024
C  0.379431 -0.72973 -0.091073
C  -0.520781 0.352052 -0.029608
C  2.741657 -1.619502 -0.101418
C  1.362566 1.902222 0.139967
C  4.116895 -1.385894 -0.039542
C  -0.011269 1.693216 0.083693
C  -2.99429 0.96379 -0.055539
C  -4.345312 0.327282 -0.019626
C  -5.459633 1.141936 -0.363187
C  -4.598121 -1.01936 0.365163
C  -7.013222 -0.720416 0.019991
C  -6.765539 0.636669 -0.352074
C  -5.902471 -1.538832 0.387389
H  4.110378 2.071027 0.245273
H  -0.040261 -1.743448 -0.17239
H  1.747817 2.923971 0.230183
H  4.823505 -2.21906 -0.06971
H  -0.720983 2.520808 0.117379
H  -2.146819 -0.921053 -0.163647
H  1.369623 -3.054618 -0.299066
H  -5.264907 2.184416 -0.635367
H  -3.785841 -1.676578 0.702315
H  -7.6061 1.284319 -0.628338
H  -6.073547 -2.575016 0.702539
H  7.674253 0.412711 -1.78332
H  -8.488064 -2.191692 0.301182
H  -9.098225 -0.642888 -0.215099
