program: Gaussian 09
title: 000235583
version: EM64L-G09RevD.01
frameworkgroup: C1[X(C16H11N3O4)]
method: RPBEPBE
basis: SDD
operation: Freq
keyword: #p
keyword: freq=noraman
keyword: PBEPBE/SDD
title: #p freq=noraman PBEPBE/SDD
converged: YES YES NO NO
title: Mulliken charges:
elementType: O O O O N N N C C C C C C C C C C C C C C C C H H H H H H H H H H H
charge: -0.185673 -0.263570 -0.212584 -0.205920 -0.477254 0.023524 0.016026 0.164368 0.278952 0.423879 0.339972 -0.399469 0.224306 -0.371665 -0.448530 -0.417368 -0.235736 -0.308923 -0.502877 0.446023 -0.246202 -0.401340 -0.236167 0.360300 0.272571 0.244136 0.246467 0.243406 0.237103 0.288882 0.336257 0.237414 0.293427 0.236266
chargesum: 0.00000
title: Mulliken charges with hydrogens summed into heavy atoms:
elementType: O O O O N N N C C C C C C C C C C C C C C C C
charge: -0.185673 -0.263570 -0.212584 -0.205920 -0.116954 0.023524 0.016026 0.164368 0.278952 0.423879 0.339972 -0.126897 0.224306 -0.127529 -0.202062 -0.173962 0.001367 -0.020041 -0.166620 0.446023 -0.008788 -0.107913 0.000098
polarizability: 4.29506518e+02 1.80613309e+00 2.47143674e+02 -5.22555404e+00 1.38485869e+01 1.17187665e+02
1716.lowfreq: -1.3310 -0.0008 -0.0007 -0.0006 4.1369 6.7200 20.6665 35.8539 52.8097
frequency: 20.6618 35.8261 52.8043 60.3136 78.4202 108.3280 129.6907 162.3341 168.0123 181.5857 196.0815 231.6474 277.6281 314.8770 338.1043 359.1299 385.9990 420.3929 435.0904 450.8305 470.9287 489.6939 504.5414 513.6751 516.2385 561.7962 564.2884 620.6439 631.0564 649.1580 661.0026 670.5853 704.8198 721.2172 745.7189 746.2642 762.4390 780.5575 782.4013 805.0830 815.9107 832.3308 843.2950 868.4385 884.5897 897.6038 921.5257 966.2063 966.8215 982.9567 999.0304 1001.9754 1023.1362 1045.4945 1055.4738 1087.4670 1103.3472 1142.9168 1152.3421 1160.8533 1180.3827 1187.7674 1207.7473 1233.0211 1238.9373 1263.2740 1280.4042 1306.3314 1343.9395 1353.8398 1365.2935 1388.7780 1409.7310 1421.0230 1442.8379 1450.2937 1456.1427 1488.7583 1513.8354 1527.5638 1580.4821 1589.2530 1596.8115 1623.1391 1633.5305 3128.1036 3133.5514 3136.6887 3148.5443 3151.3474 3166.9946 3168.8521 3172.7588 3188.0946 3190.4956 3207.9542
redmass: 7.0750 6.5842 6.7600 11.9585 9.0688 7.4189 5.6099 7.4279 5.9771 4.8231 6.8096 5.3944 5.9946 8.3281 6.1779 8.7423 8.1552 3.3589 4.0456 4.6804 3.3358 8.8514 6.0409 4.1803 6.5835 3.6649 5.6451 6.1620 4.2533 7.0966 6.3259 8.2836 7.5227 4.9827 6.8753 1.3278 5.6618 4.0669 3.2619 2.0619 2.0666 1.3370 1.4459 4.5803 1.7070 5.4408 1.4033 1.4003 1.3687 1.3719 1.3512 1.3211 3.2959 2.4500 2.2233 2.1510 4.0132 1.4704 1.4821 6.0077 1.1018 1.2550 3.6314 2.1336 1.9971 1.6703 2.0541 2.3773 4.3746 2.8094 5.9786 3.5101 3.0017 6.7636 2.4530 5.2290 2.5231 3.4512 3.5686 3.3066 5.7003 4.8791 4.3587 7.2717 6.2964 1.0869 1.0870 1.0882 1.0920 1.0950 1.0987 1.1003 1.0889 1.0922 1.0968 1.0780
irintensity: 0.0792 1.2531 0.1638 0.3108 0.7881 1.3637 0.6967 3.1764 2.6617 3.0721 1.9105 2.8050 1.1933 0.5668 2.8755 0.4071 2.0151 8.2397 2.7137 2.2367 1.1768 12.4000 5.0575 8.6065 6.3511 6.9268 10.9799 0.4182 8.5365 13.2094 3.5763 13.0712 9.1100 3.2823 1.8761 1.9598 14.0918 6.3604 33.6037 91.8129 5.3834 75.9489 19.7017 3.7803 13.1584 4.8764 2.1250 23.5909 2.4529 2.1638 0.4598 0.6628 9.6555 13.7414 6.2934 5.3005 62.5456 20.5532 12.9499 311.0936 2.0406 35.9821 536.4796 149.1081 17.5049 9.2401 2.5426 102.6870 234.8128 37.7060 30.3524 56.2581 15.7366 0.6422 17.8412 10.0803 4.6326 108.0005 42.9491 74.1125 115.4490 75.6062 6.4843 366.9054 20.9963 2.6008 0.1430 0.7099 12.1851 33.3408 20.7791 21.4358 2.3851 14.1836 6.2364 98.0258
temp: 298.150 k
press: 1.00000 atm
elementType: 8 8 8 8 7 7 7 6 6 6 6 6 6 6 6 6 6 6 6 6 6 6 6 1 1 1 1 1 1 1 1 1 1 1
symmnumber: 1
zpe: 639631.8 jmol-1
zpe.correction: 0.243623 hartree
zpe.thermalcorrener: 0.261631 hartree
zpe.thermalcorrenthalpy: 0.262575 hartree
zpe.thermalcorrgfe: 0.195834 hartree
zpe.sumelectzpe: -1079.726054 hartree
zpe.sumelectthermal: -1079.708046 hartree
zpe.sumelectthermalent: -1079.707102 hartree
zpe.sumelectthermalfe: -1079.773843 hartree
dipole: -8.3009 -3.0438 0.2235
dipole: 8.8442
quadrupole: -151.9232 -137.8918 -131.9890
quadrupole: 4.3648 -6.1472 11.6318
quadrupole: -11.3219 2.7096 8.6123 4.3648 -6.1472 11.6318
hfenergy: -1079.9696766 hartree
pointgroup: C01 [X(C16H11N3O4)]
dipole: -3.2430042 -1.260864 -0.0216 debye
polarizability: 429.4571239|5.228527|245.3507535|-1.3914436|20.9332332|119.0299796 unknown
InChI: InChI=1S/C16H11N3O4/c20-18(21)12-8-9-15(16(10-12)19(22)23)17-14-7-3-5-11-4-1-2-6-13(11)14/h1-10,17H
charge 0 multiplicity 1
34 atoms
O  2.64065 3.317659 -0.648502
O  0.404391 2.89345 -0.584438
O  5.282942 -2.154777 0.890132
O  5.910036 0.010978 0.509711
N  -0.435963 0.435585 -0.360386
N  1.659374 2.500935 -0.490526
N  5.018596 -0.920445 0.600612
C  -2.810756 -0.018907 0.099762
C  -1.560374 -0.4326 -0.498486
C  -3.98327 -0.842477 -0.120044
C  0.876376 0.100295 -0.121308
C  -1.490802 -1.606707 -1.264019
C  1.931515 1.096033 -0.189637
C  -2.936378 1.162801 0.902759
C  -3.871864 -2.0446 -0.893259
C  -5.235247 -0.437733 0.450417
C  -2.647358 -2.419033 -1.449543
C  1.275325 -1.234693 0.23563
C  3.282577 0.756425 0.038583
C  3.610554 -0.564152 0.360294
C  -4.171564 1.52949 1.444182
C  2.604663 -1.564437 0.478483
C  -5.332549 0.727368 1.212911
H  -0.572733 1.460407 -0.477178
H  -0.555712 -1.8789 -1.763196
H  -2.056291 1.780524 1.110078
H  -4.764663 -2.660669 -1.048762
H  -6.118516 -1.063502 0.277079
H  -2.568152 -3.327831 -2.054749
H  0.500454 -1.995621 0.349858
H  4.056749 1.524637 -0.032826
H  -4.251784 2.434374 2.055678
H  2.896722 -2.577191 0.768218
H  -6.29385 1.028414 1.642371
