program: Gaussian 09
title: 000235580
version: EM64L-G09RevD.01
frameworkgroup: C1[X(C15H17NO6S2)]
method: RPBEPBE
basis: SDD
operation: Freq
keyword: #p
keyword: freq=noraman
keyword: PBEPBE/SDD
title: #p freq=noraman PBEPBE/SDD
converged: YES YES NO NO
title: Mulliken charges:
elementType: S S O O O O O O N C C C C C C C C C C C C C C C H H H H H H H H H H H H H H H H H
charge: 0.977436 0.993899 -0.569382 -0.563783 -0.506985 -0.503929 -0.503058 -0.502099 -0.194948 -0.576115 0.508135 -0.384938 0.472267 -0.360683 -0.385041 -0.339307 -0.384017 -0.054807 -0.665083 -0.059840 -0.240133 -0.227708 -0.207949 -0.290408 0.246915 0.265260 0.228698 0.237690 0.289090 0.242755 0.269728 0.247175 0.217126 0.236103 0.226106 0.285235 0.285912 0.238949 0.285613 0.381260 0.384862
chargesum: 0.00000
title: Mulliken charges with hydrogens summed into heavy atoms:
elementType: S S O O O O O O N C C C C C C C C C C C C C C C
charge: 0.977436 0.993899 -0.188122 -0.178921 -0.506985 -0.503929 -0.503058 -0.502099 -0.194948 -0.063939 0.508135 0.081450 0.472267 -0.071593 -0.142286 -0.069579 -0.136843 -0.054807 0.014252 -0.059840 0.045102 0.058204 0.031000 -0.004795
polarizability: 3.09351991e+02 -1.44205551e-01 2.43628360e+02 -2.34504321e+01 4.51163263e+00 1.94982662e+02
1716.lowfreq: -4.9995 -1.3710 -0.0016 0.0008 0.0010 3.6934 11.7907 17.8975 19.1438
frequency: 11.3062 17.8193 19.0771 35.4721 41.8080 47.0765 65.5049 84.5355 109.8488 113.0407 123.6119 141.2746 161.3976 166.7790 175.2530 183.7469 210.6404 214.5496 219.1691 232.8049 258.2516 269.5575 283.0043 303.4349 307.1232 328.6036 348.6400 349.9253 368.5851 394.4292 406.2173 411.0875 426.0146 433.9524 454.4140 490.5000 517.2525 535.3297 551.4344 577.0332 587.1308 616.9961 633.3740 659.7788 679.3653 713.2749 758.1275 776.7681 781.4002 794.0167 822.9553 834.8133 835.7666 850.4040 868.6892 880.7112 895.6788 957.3550 963.7868 966.8489 968.2345 973.9271 988.4006 991.7182 994.1077 1015.8715 1046.8911 1052.9359 1059.6062 1072.4873 1078.1775 1091.4827 1117.3307 1126.1031 1177.8009 1184.7793 1187.8459 1203.6090 1244.5548 1280.1231 1290.5077 1301.1249 1329.0432 1349.5456 1371.6648 1389.9934 1391.4547 1395.1223 1409.4428 1446.0800 1465.2918 1469.3055 1474.6914 1481.9088 1490.6715 1507.6076 1550.9668 1594.3387 1598.2966 1625.4498 2977.6947 2986.8875 3000.1134 3029.6224 3049.2750 3082.8634 3092.7318 3131.7921 3146.1413 3154.1309 3157.8490 3166.1709 3171.8920 3172.8668 3184.9528 3479.6173 3481.4648
redmass: 8.6938 8.7117 9.0470 5.2737 4.0203 4.3735 7.0515 3.7284 6.0509 6.3267 4.2078 5.5389 2.5553 1.5808 2.0732 1.5768 3.0755 2.7959 4.4361 4.8807 4.7036 4.0943 4.1592 4.5368 6.2978 9.1576 7.0616 4.2758 6.2352 3.1707 2.8745 3.4393 9.9837 5.8987 3.6303 3.3185 3.3323 9.6895 6.7719 5.1368 6.4775 6.8952 5.6555 6.2711 2.1334 3.5121 4.4830 1.4571 3.5053 1.2422 1.5513 11.8488 8.5835 1.2697 1.5589 1.3386 2.3620 5.4350 1.7522 8.0970 6.4283 1.3544 1.4772 2.6306 3.4186 2.5266 1.3685 1.1830 1.8841 2.1662 2.0187 1.6329 1.3396 1.8523 2.1454 1.1333 1.2187 2.5967 1.4365 1.2582 1.3004 1.3311 1.5350 1.3054 3.8840 4.4347 1.2745 2.3738 2.2495 2.8158 1.3839 1.1953 1.3408 1.1364 1.4487 1.8306 6.3158 6.2928 6.8147 6.8287 1.0624 1.0359 1.0614 1.0984 1.1024 1.0997 1.1010 1.0898 1.0877 1.0883 1.0909 1.0955 1.0972 1.0923 1.0975 1.0661 1.0661
irintensity: 0.7262 1.4989 0.1435 1.1704 1.1291 1.0850 0.9515 0.1427 1.5639 1.1434 0.4427 0.5318 53.3241 7.0710 39.6165 5.0912 14.6979 9.5771 15.2044 2.7014 24.9780 15.9629 72.6306 22.4035 8.3801 13.5210 0.2821 22.4293 4.8360 17.7530 0.1026 16.7130 78.0979 40.9069 0.6028 7.8390 6.9024 150.3412 74.7506 95.0345 31.1202 5.2048 20.3056 18.9937 23.6797 2.9829 4.8383 55.2496 5.6739 12.9989 26.3737 78.1795 71.3773 0.7234 20.2085 5.6838 21.5308 13.5806 29.8648 48.9437 116.2946 0.5434 6.3125 25.7828 15.3165 3.9950 36.7905 68.5447 76.1870 19.7306 8.9927 2.5938 3.0790 27.8360 25.3958 3.4222 3.9370 29.5798 60.2506 19.6345 11.3795 3.3307 16.1108 36.5409 8.3064 12.5344 30.1251 54.1370 15.2670 5.6920 39.9638 7.5801 5.4639 21.1277 86.3670 139.8862 37.6469 7.4536 9.5935 258.8357 28.1495 24.3809 30.3027 6.7357 5.7606 36.8854 41.7341 8.1631 12.0122 3.2955 6.7352 1.7848 4.0568 9.8104 12.1674 42.8765 45.3776
temp: 298.150 k
press: 1.00000 atm
elementType: 16 16 8 8 8 8 8 8 7 6 6 6 6 6 6 6 6 6 6 6 6 6 6 6 1 1 1 1 1 1 1 1 1 1 1 1 1 1 1 1 1
symmnumber: 1
zpe: 780690.8 jmol-1
zpe.correction: 0.297349 hartree
zpe.thermalcorrener: 0.323168 hartree
zpe.thermalcorrenthalpy: 0.324112 hartree
zpe.thermalcorrgfe: 0.237776 hartree
zpe.sumelectzpe: -1881.867479 hartree
zpe.sumelectthermal: -1881.841660 hartree
zpe.sumelectthermalent: -1881.840716 hartree
zpe.sumelectthermalfe: -1881.927053 hartree
dipole: 2.8228 6.7523 2.0108
dipole: 7.5898
quadrupole: -187.6717 -148.2586 -154.1416
quadrupole: 16.2577 -8.2221 -5.1003
quadrupole: -24.3144 15.0987 9.2157 16.2577 -8.2221 -5.1003
hfenergy: -1882.1648284 hartree
pointgroup: C01 [X(C15H17N1O6S2)]
dipole: 1.6844654 2.3202313 0.8340872 debye
polarizability: 300.6199131|-8.3742757|243.8198903|-34.7453411|14.4111956|203.5232093 unknown
InChI: InChI=1S/C15H17NO6S2/c1-2-16(13-4-3-5-15(10-13)24(20,21)22)11-12-6-8-14(9-7-12)23(17,18)19/h3-10,17,20H,2,11H2,1H3
charge 0 multiplicity 1
41 atoms
S  3.113281 -3.089323 -0.46973
S  -5.320866 0.054521 0.096804
O  4.36154 -3.083505 0.910278
O  -5.22025 -1.743545 0.545481
O  1.664144 -3.455131 0.152709
O  3.721498 -3.956735 -1.692578
O  -6.280884 0.801693 1.164187
O  -5.606293 0.17538 -1.491496
N  1.397193 1.837937 0.162678
C  0.587116 1.431229 1.318789
C  2.307322 0.969291 -0.451636
C  1.288077 3.259895 -0.233425
C  -0.872302 1.088928 0.997225
C  2.277215 -0.43829 -0.191507
C  3.291969 1.445026 -1.379121
C  -1.253097 0.647057 -0.293945
C  -1.854583 1.205161 2.013947
C  3.214565 -1.251697 -0.834903
C  2.269744 4.195069 0.510305
C  -3.527998 0.442261 0.465619
C  -2.595756 0.313145 -0.574657
C  -3.202777 0.877319 1.759834
C  4.194232 0.56978 -2.012094
C  4.187557 -0.819907 -1.746549
H  0.601881 2.250392 2.065202
H  1.065423 0.569655 1.820616
H  1.427097 3.34344 -1.32653
H  0.248129 3.579035 -0.033158
H  1.52443 -0.902688 0.452418
H  3.361261 2.512243 -1.604292
H  -0.498997 0.568952 -1.083127
H  -1.568586 1.555947 3.012683
H  2.110597 4.149904 1.603008
H  3.320584 3.921636 0.311994
H  2.117436 5.241929 0.1899
H  -2.909184 -0.022141 -1.568079
H  -3.976677 0.975424 2.527301
H  4.928452 0.978586 -2.714166
H  4.878503 -1.517163 -2.226096
H  4.503676 -4.036334 1.184579
H  -6.118673 -2.150576 0.370832
