program: Gaussian 09
title: 000235578
version: EM64L-G09RevD.01
frameworkgroup: C1[X(C15H13NO)]
method: RPBEPBE
basis: SDD
operation: Freq
keyword: #p
keyword: freq=noraman
keyword: PBEPBE/SDD
title: #p freq=noraman PBEPBE/SDD
converged: YES YES NO NO
title: Mulliken charges:
elementType: O N C C C C C C C C C C C C C C C H H H H H H H H H H H H H
charge: -0.429006 -0.071565 0.485940 0.229316 -0.378677 -0.393212 -0.305249 -0.338884 -0.301765 0.277264 -0.361853 -0.344755 -0.235495 -0.234294 -0.239358 -0.221226 -0.273606 0.230183 0.228587 0.215913 0.256002 0.237005 0.221561 0.250483 0.227828 0.228440 0.231245 0.250329 0.203442 0.355408
chargesum: 0.00000
title: Mulliken charges with hydrogens summed into heavy atoms:
elementType: O N C C C C C C C C C C C C C C C
charge: -0.073598 -0.071565 0.485940 0.229316 -0.148495 -0.164625 -0.089336 -0.082883 -0.064760 0.277264 -0.140292 -0.094272 -0.007667 -0.005853 -0.008114 0.029103 -0.070163
polarizability: 5.15245173e+02 1.28623488e+01 1.59898874e+02 -1.21337057e+00 7.71917198e-01 7.15511797e+01
1716.lowfreq: -7.6885 -3.8291 -0.0005 0.0003 0.0005 1.5183 26.8091 31.8336 38.6145
frequency: 26.7226 31.8193 38.6113 73.8605 115.9125 143.2111 182.7365 211.8720 243.7019 294.3252 323.1366 360.9709 375.2090 402.2690 403.0479 416.5370 428.7598 480.4501 507.9755 529.9498 567.6624 614.9329 616.0675 635.9368 693.9471 721.3668 757.9746 767.7897 803.9173 819.8296 831.1224 844.6193 853.3960 878.9603 926.6766 938.6991 949.6941 955.0553 978.3008 987.4275 990.4843 994.6093 1001.9791 1025.6660 1081.6219 1099.1353 1140.9129 1150.9266 1170.7068 1173.7846 1190.8323 1203.2024 1230.8922 1249.7779 1267.1738 1290.4994 1305.7866 1327.9888 1358.9606 1379.1559 1389.2886 1431.2905 1440.8130 1482.5604 1493.4410 1560.3147 1576.5448 1579.8468 1609.8682 1618.3222 1636.2979 2942.7053 3079.4390 3117.2426 3118.2884 3127.5564 3135.2760 3136.0564 3140.8987 3151.5104 3165.4690 3166.4641 3169.7507 3582.9972
redmass: 3.7958 6.0201 5.1602 4.5284 5.3529 3.6878 2.7649 5.5347 4.6035 4.7412 3.1728 1.1117 4.4757 4.1284 3.0001 3.2769 6.6911 4.3168 2.6891 2.5788 5.8103 5.9413 5.3334 6.4550 1.7071 3.6743 5.7000 1.7284 1.2654 4.1691 1.8683 1.2933 5.2436 1.6045 1.5593 1.3689 1.3891 1.5199 1.3921 5.9996 1.3106 2.4115 1.2523 2.1853 1.6652 1.3946 1.5014 2.0374 1.3016 1.1151 1.1223 2.2237 1.5305 2.4473 1.8420 1.5484 1.4744 1.3622 1.7410 3.9473 5.0540 3.7738 2.3287 2.2735 2.7058 5.6577 6.2584 5.5158 6.0392 6.2315 5.5888 1.0860 1.0893 1.0899 1.0873 1.0863 1.0903 1.0883 1.0913 1.0957 1.0946 1.1015 1.0960 1.0660
irintensity: 0.9924 0.7596 0.1588 1.6109 1.4913 2.5629 11.0537 0.6159 0.4524 11.0687 7.0334 150.5222 5.6614 2.3138 0.4772 9.8420 21.9216 2.8185 21.4716 11.2329 1.0168 2.1038 5.1743 0.9098 44.8797 4.4784 33.7740 69.8627 8.3827 13.3805 69.6322 0.6818 0.9106 0.4292 0.5588 0.8297 0.9618 2.9247 0.0347 0.3383 37.4445 3.6187 37.5813 5.2370 8.9421 91.6431 280.4519 50.1277 40.4385 7.9099 1.5129 1.2421 4.4847 67.2177 7.8164 2.7558 1.7715 2.9181 0.5371 19.8595 7.1625 11.3629 15.2872 38.3752 105.3209 5.4332 41.5716 2.1538 1.9206 54.2742 105.7707 60.4700 18.9769 33.4599 9.1149 5.0724 22.7792 4.8190 5.7945 37.5697 10.8958 43.6218 7.0910 97.6352
temp: 298.150 k
press: 1.00000 atm
elementType: 8 7 6 6 6 6 6 6 6 6 6 6 6 6 6 6 6 1 1 1 1 1 1 1 1 1 1 1 1 1
symmnumber: 1
zpe: 617397.4 jmol-1
zpe.correction: 0.235154 hartree
zpe.thermalcorrener: 0.249875 hartree
zpe.thermalcorrenthalpy: 0.250819 hartree
zpe.thermalcorrgfe: 0.191406 hartree
zpe.sumelectzpe: -708.161992 hartree
zpe.sumelectthermal: -708.147272 hartree
zpe.sumelectthermalent: -708.146328 hartree
zpe.sumelectthermalfe: -708.205741 hartree
dipole: -0.4600 -0.0451 -0.6111
dipole: 0.7662
quadrupole: -73.6641 -89.5746 -106.5160
quadrupole: 10.4074 -4.0663 -0.1225
quadrupole: 16.2541 0.3436 -16.5978 10.4074 -4.0663 -0.1225
hfenergy: -708.3971467 hartree
pointgroup: C01 [X(C15H13N1O1)]
dipole: -0.1825362 -0.0861013 -0.2239026 debye
polarizability: 514.797658|15.592906|153.7139325|-9.3120934|-23.2683891|78.1836366 unknown
InChI: InChI=1S/C15H13NO/c17-15-10-8-14(9-11-15)16-12-4-7-13-5-2-1-3-6-13/h1-12,17H
charge 0 multiplicity 1
30 atoms
O  6.81681 -0.483796 0.004077
N  1.290305 0.731656 -0.206056
C  -3.542528 -0.332351 -0.000455
C  2.65917 0.368443 -0.136766
C  -4.053149 0.998028 -0.084327
C  -4.478319 -1.404941 0.088669
C  -2.107968 -0.642226 -0.002222
C  3.586621 1.264648 -0.737104
C  3.171099 -0.788593 0.529388
C  5.451568 -0.159405 -0.068298
C  4.969165 1.002629 -0.720545
C  4.551283 -1.048354 0.567305
C  -5.44022 1.238677 -0.08115
C  -5.867452 -1.163513 0.0915
C  -6.356287 0.160846 0.006112
C  -1.064726 0.249681 -0.104875
C  0.32577 -0.162045 -0.093275
H  -3.361359 1.844784 -0.149755
H  -4.103891 -2.434315 0.154731
H  -1.855075 -1.710536 0.087469
H  3.189227 2.161584 -1.221829
H  2.488641 -1.469783 1.050293
H  5.666736 1.700613 -1.201476
H  4.954028 -1.921938 1.088535
H  -5.81348 2.266917 -0.145865
H  -6.567558 -2.003501 0.159952
H  -7.434822 0.353011 0.008153
H  -1.233139 1.329134 -0.200838
H  0.518893 -1.253653 -0.010103
H  7.366356 0.1980 -0.456346
