program: Gaussian 09
title: 000235577
version: EM64L-G09RevD.01
frameworkgroup: C1[X(C15H12O4)]
method: RPBEPBE
basis: SDD
operation: Freq
keyword: #pfreq=noraman
keyword: PBEPBE/SDD
title: #p freq=noraman PBEPBE/SDD
converged: YES YES NO NO
title: Mulliken charges:
elementType: O O O O C C C C C C C C C C C C C C C H H H H H H H H H H H H
charge: -0.441449 -0.255017 -0.441691 -0.255607 -0.728224 0.447514 0.510915 0.079479 -0.402319 -0.374375 -0.403066 -0.320198 -0.355776 -0.336505 0.253186 -0.231247 -0.233664 0.090613 0.106999 0.229147 0.263931 0.242631 0.242372 0.250354 0.281859 0.267811 0.272083 0.235122 0.237576 0.385475 0.382071
chargesum: 0.00000
title: Mulliken charges with hydrogens summed into heavy atoms:
elementType: O O O O C C C C C C C C C C C C C C C
charge: -0.055974 -0.255017 -0.059620 -0.255607 -0.235146 0.447514 0.510915 0.079479 -0.159688 -0.132003 -0.152712 -0.038339 -0.087965 -0.064422 0.253186 0.003875 0.003912 0.090613 0.106999
polarizability: 2.25084493e+02 2.72321562e+01 1.73634286e+02 3.90338043e+00 9.04271204e+00 1.26802712e+02
1716.lowfreq: -10.1792 -3.1683 -0.0008 -0.0006 -0.0006 2.8946 19.5016 25.7455 46.5206
frequency: 19.3812 25.4150 46.5160 57.7475 75.7374 98.8990 126.2845 158.7630 221.1842 229.6042 267.5805 275.6450 356.0193 365.2355 391.3533 406.4173 420.3969 461.4833 480.6454 485.1502 511.5442 572.8715 584.1208 589.9396 604.2419 609.9167 633.7059 684.0657 689.2321 701.3530 716.2374 748.8826 768.4953 795.8013 817.0390 833.2632 856.8227 860.6919 904.0036 932.6077 978.5393 987.2847 994.0569 996.4512 1002.5922 1005.0930 1024.6146 1047.0783 1104.3400 1120.0572 1150.9974 1158.8171 1176.8766 1187.8971 1192.2534 1198.2700 1213.2337 1284.9797 1301.7164 1310.6225 1320.1339 1323.2921 1379.5239 1392.8246 1414.3350 1431.2489 1456.1758 1479.7889 1501.0124 1575.4437 1579.4559 1606.0109 1619.4988 1636.1408 1641.9727 2986.7561 3076.8898 3125.1916 3132.8205 3142.3960 3150.6339 3160.2396 3160.5959 3177.7450 3183.8950 3529.6964 3532.1786
redmass: 5.5925 6.9172 5.9844 11.0956 6.3745 6.4800 4.5375 6.9001 6.0511 5.1802 6.1588 5.2130 3.3363 3.8338 6.5020 2.8377 3.0728 3.1871 3.6207 6.0788 4.5269 5.1363 1.3557 1.2597 3.6082 3.8443 6.7016 4.0663 4.0774 3.1391 4.5700 2.6372 3.2629 2.0998 3.2440 4.4626 1.4996 1.4046 1.5738 1.8922 1.3999 1.3938 1.3981 4.9976 4.9285 1.3537 2.7791 2.3990 1.8988 1.4288 1.7151 1.7420 1.1168 1.2144 2.3149 1.1702 2.4741 1.3933 1.4241 2.6318 2.4937 1.5496 7.7240 5.0067 2.9917 2.1246 1.1423 2.5041 2.5500 7.1677 6.6063 6.2747 6.3169 8.0098 8.5255 1.0663 1.0937 1.0871 1.0884 1.0907 1.0894 1.0957 1.0965 1.0961 1.0964 1.0641 1.0641
irintensity: 0.6625 0.4410 0.7182 1.8564 0.5554 0.1503 0.0844 0.1440 0.9922 4.1144 0.4738 1.7105 7.4486 5.2422 3.5563 0.2006 10.8628 8.7170 39.6117 10.3563 8.4635 30.8817 92.7191 99.3509 18.4614 25.6106 2.8006 34.6569 36.8307 92.2837 8.7864 30.2625 16.6273 18.9476 7.0082 0.4115 14.7392 11.3984 1.9914 17.2676 4.6485 0.0705 3.8942 233.8056 241.4892 0.8050 97.4448 6.5692 53.6212 6.5953 141.1343 78.5335 0.7314 2.5022 1.2135 4.7230 2.6187 0.8244 3.3033 77.3777 124.8511 11.8807 2.4595 1.3789 17.4119 3.7281 35.3769 24.1120 11.7541 18.7250 24.2361 13.8540 92.8588 219.7963 322.2086 23.8668 2.3435 6.2257 5.9692 13.9607 5.7180 0.6755 24.4842 2.4931 7.7958 46.6973 45.9987
temp: 298.150 k
press: 1.00000 atm
elementType: 8 8 8 8 6 6 6 6 6 6 6 6 6 6 6 6 6 6 6 1 1 1 1 1 1 1 1 1 1 1 1
symmnumber: 1
zpe: 613301.3 jmol-1
zpe.correction: 0.233594 hartree
zpe.thermalcorrener: 0.249855 hartree
zpe.thermalcorrenthalpy: 0.250799 hartree
zpe.thermalcorrgfe: 0.187262 hartree
zpe.sumelectzpe: -878.389875 hartree
zpe.sumelectthermal: -878.373614 hartree
zpe.sumelectthermalent: -878.372670 hartree
zpe.sumelectthermalfe: -878.436207 hartree
dipole: -3.1157 0.0876 0.5457
dipole: 3.1643
quadrupole: -102.7694 -100.2659 -109.7248
quadrupole: 12.7401 6.5160 -6.2522
quadrupole: 1.4840 3.9875 -5.4714 12.7401 6.5160 -6.2522
hfenergy: -878.6234691 hartree
pointgroup: C01 [X(C15H12O4)]
dipole: 1.2228048 -0.1214622 -0.1996851 debye
polarizability: 214.7144585|-34.0642366|185.5579686|-2.0363989|2.9658046|125.2490635 unknown
InChI: InChI=1S/C15H12O4/c16-14(17)11-7-5-10(6-8-11)9-12-3-1-2-4-13(12)15(18)19/h1-8,16,18H,9H2
charge 0 multiplicity 1
31 atoms
O  2.804644 1.775897 2.012334
O  1.608441 2.273484 0.099818
O  -5.136361 1.640711 0.567055
O  -5.144815 -0.592096 1.200743
C  0.854968 0.073165 -1.60441
C  1.895431 -0.615846 -0.725486
C  -0.535448 0.170423 -0.967502
C  2.511186 -0.000356 0.4132
C  2.255677 -1.953536 -1.027174
C  -1.152328 -0.968844 -0.384052
C  -1.251435 1.394599 -0.993854
C  3.435442 -0.735065 1.207091
C  -2.452763 -0.8906 0.146836
C  -2.555255 1.481309 -0.467494
C  -3.165774 0.336094 0.105206
C  3.178966 -2.67573 -0.240661
C  3.769547 -2.064581 0.888419
C  2.240443 1.420314 0.772024
C  -4.536294 0.372072 0.67309
H  0.766392 -0.507876 -2.543588
H  1.189108 1.088647 -1.87095
H  1.800833 -2.433942 -1.901588
H  -0.606847 -1.918429 -0.341895
H  -0.77233 2.283668 -1.416045
H  3.8868 -0.241052 2.071031
H  -2.936691 -1.764021 0.59647
H  -3.106134 2.425723 -0.488178
H  3.433929 -3.707398 -0.507248
H  4.484384 -2.615414 1.508377
H  2.596112 2.733215 2.184123
H  -6.04663 1.590862 0.964708
