program: Gaussian 09
title: 000235576
version: EM64L-G09RevD.01
frameworkgroup: C1[X(C15H8O5)]
method: RPBEPBE
basis: SDD
operation: Freq
keyword: #pfreq=noraman
keyword: PBEPBE/SDD
title: #p freq=noraman PBEPBE/SDD
converged: YES YES NO NO
title: Mulliken charges:
elementType: O O O O O C C C C C C C C C C C C C C C H H H H H H H H
charge: -0.338640 -0.312065 -0.177850 -0.455334 -0.197809 -0.004716 0.350348 0.293542 0.275952 -0.033286 -0.259195 0.047807 -0.422836 0.148392 -0.364460 -0.291882 -0.372274 -0.224313 -0.221497 0.106180 0.295641 0.296337 0.295571 0.294055 0.245279 0.245068 0.393858 0.388127
chargesum: 0.00000
title: Mulliken charges with hydrogens summed into heavy atoms:
elementType: O O O O O C C C C C C C C C C C C C C C
charge: 0.055217 -0.312065 -0.177850 -0.067207 -0.197809 -0.004716 0.350348 0.293542 0.275952 -0.033286 -0.259195 0.047807 -0.127195 0.148392 -0.068889 0.004455 -0.078219 0.020966 0.023571 0.106180
polarizability: 3.28857847e+02 -4.75757941e+00 2.02543480e+02 1.54226682e-02 1.29292543e-02 6.60467883e+01
1716.lowfreq: -8.2676 0.0008 0.0009 0.0012 5.2902 9.0789 17.3881 40.9499 83.4221
frequency: 17.2425 40.9450 83.4217 105.6101 140.6047 142.1107 182.0768 232.3550 256.8750 268.3204 271.3655 317.1924 364.7653 387.5668 419.7580 426.4704 429.8297 435.8907 475.7354 486.0026 528.2814 558.0365 582.1455 589.3983 604.5359 651.6930 660.7028 679.0150 711.3764 716.9435 726.0504 776.5928 788.2062 805.1641 850.0285 877.9175 898.4496 938.1646 942.0878 983.0699 998.3277 999.7852 1011.6766 1018.0412 1039.1109 1049.5859 1089.7521 1153.9239 1172.1018 1176.8308 1195.7931 1226.6699 1268.3441 1295.7870 1308.7025 1312.9179 1361.7803 1392.9005 1406.1171 1418.8852 1440.1971 1448.8190 1474.7427 1529.0960 1558.4370 1569.4946 1593.0771 1606.0850 1619.2156 1656.4034 2635.3775 3141.2236 3155.3977 3166.1815 3168.5698 3175.6681 3189.2226 3534.2631
redmass: 12.2909 7.3571 6.9126 6.0415 6.8801 7.6786 7.0613 6.4895 6.0242 9.2389 5.7160 8.0132 7.8565 8.0899 3.3541 11.1682 5.1143 9.5625 9.7093 3.4221 6.6639 4.4255 7.8948 1.3499 5.2239 6.7656 4.6639 6.4251 4.8600 6.8795 2.6736 5.4299 7.0020 1.6697 2.4551 7.7038 1.5408 7.4951 1.9832 1.0661 5.4341 1.3964 1.4012 1.3795 2.0386 3.1569 2.1930 1.7468 1.2585 1.6763 2.1848 1.8004 1.8588 2.0876 4.7580 4.0220 3.7839 8.4847 8.5782 3.2099 3.1570 2.8685 2.8690 5.6122 5.0646 7.2562 5.8049 5.3054 4.8411 9.0728 1.0744 1.0866 1.0904 1.0949 1.0898 1.1002 1.0955 1.0643
irintensity: 0.8725 2.3159 3.5599 0.0144 0.5030 0.9990 0.0332 0.3051 0.4665 0.2944 2.5149 4.8754 0.9519 11.1646 2.0089 8.5601 2.8840 22.3615 3.4215 14.9369 30.3327 0.9242 17.0407 110.6766 36.2796 4.8240 27.6949 11.4468 27.5832 4.2348 43.0475 33.1240 8.8910 30.4150 3.7958 13.2873 23.0063 91.8124 4.9285 130.2364 210.9221 6.1399 0.3869 0.1338 4.3745 303.8742 21.6640 31.8149 23.0909 10.8580 2.3057 26.2519 49.8624 361.1270 208.8082 17.9944 173.3488 0.3105 18.3973 204.8133 80.5511 4.2192 31.8150 75.7817 104.6950 5.2304 48.3392 30.1782 116.6102 278.3087 254.9053 3.3530 5.0426 2.4368 1.0458 24.3272 0.0792 58.7799
temp: 298.150 k
press: 1.00000 atm
elementType: 8 8 8 8 8 6 6 6 6 6 6 6 6 6 6 6 6 6 6 6 1 1 1 1 1 1 1 1
symmnumber: 1
zpe: 507877.6 jmol-1
zpe.correction: 0.193440 hartree
zpe.thermalcorrener: 0.208589 hartree
zpe.thermalcorrenthalpy: 0.209533 hartree
zpe.thermalcorrgfe: 0.149883 hartree
zpe.sumelectzpe: -951.195999 hartree
zpe.sumelectthermal: -951.180850 hartree
zpe.sumelectthermalent: -951.179906 hartree
zpe.sumelectthermalfe: -951.239556 hartree
dipole: 3.3237 1.3956 0.0069
dipole: 3.6048
quadrupole: -88.0228 -124.3567 -114.8701
quadrupole: -17.8995 -0.0306 -0.0318
quadrupole: 21.0604 -15.2734 -5.7869 -17.8995 -0.0306 -0.0318
hfenergy: -951.3894393 hartree
pointgroup: C01 [X(C15H8O5)]
dipole: -1.3057092 -0.5534356 -0.0153244 debye
polarizability: 328.8643831|-4.3490403|202.5008086|2.4985304|1.2582563|66.082923 unknown
InChI: InChI=1S/C15H8O5/c16-12-7-3-1-2-4-8(7)13(17)11-9(12)5-6-10(14(11)18)15(19)20/h1-6,18-19H
charge 0 multiplicity 1
28 atoms
O  1.994494 2.099962 0.062767
O  -0.477713 2.524655 0.043496
O  -1.521366 -2.894484 -0.021392
O  5.123688 -0.851001 0.072145
O  4.695775 1.429142 0.07556
C  0.381468 0.280036 0.029042
C  0.120303 -1.123463 0.012492
C  -2.117729 0.75641 0.01004
C  -2.394555 -0.643151 -0.00674
C  -0.720243 1.248545 0.028376
C  -1.286211 -1.6452 -0.006276
C  1.743637 0.764854 0.046777
C  1.19185 -2.037259 0.013827
C  2.825973 -0.180958 0.048221
C  -3.185665 1.687443 0.00926
C  2.520122 -1.563792 0.031735
C  -3.737387 -1.090937 -0.024113
C  -4.519105 1.231676 -0.008068
C  -4.795528 -0.159359 -0.024776
C  4.248187 0.262868 0.066264
H  0.968506 -3.107381 0.000895
H  3.356117 -2.267088 0.033201
H  -2.945253 2.754705 0.022375
H  -3.922746 -2.169553 -0.036888
H  -5.343189 1.952572 -0.00864
H  -5.832805 -0.509883 -0.038231
H  1.072726 2.591987 0.058751
H  6.056451 -0.506549 0.083602
