program: Gaussian 09
title: 000235575
version: EM64L-G09RevD.01
frameworkgroup: C1[X(C15H7ClO4)]
method: RPBEPBE
basis: SDD
operation: Freq
keyword: #p
keyword: freq=noraman
keyword: PBEPBE/SDD
title: #p freq=noraman PBEPBE/SDD
converged: YES YES NO NO
title: Mulliken charges:
elementType: Cl O O O O C C C C C C C C C C C C C C C H H H H H H H
charge: 0.034097 -0.189345 -0.165744 -0.403176 -0.212630 0.046657 0.415194 0.321243 0.250272 -0.159391 -0.175153 0.304196 -0.337118 -0.375603 -0.366386 -0.376670 -0.225189 -0.226035 -0.222885 0.057788 0.291975 0.294703 0.270705 0.273251 0.244406 0.244244 0.386596
chargesum: 0.00000
title: Mulliken charges with hydrogens summed into heavy atoms:
elementType: Cl O O O O C C C C C C C C C C C C C C C
charge: 0.034097 -0.189345 -0.165744 -0.016581 -0.212630 0.046657 0.415194 0.321243 0.250272 -0.159391 -0.175153 0.304196 -0.337118 -0.083629 -0.071683 -0.105965 0.048062 0.018371 0.021359 0.057788
polarizability: 2.67349095e+02 2.82981771e+00 2.36437668e+02 -5.41595319e+00 3.98335648e+00 7.83412633e+01
1716.lowfreq: -9.1631 -0.0010 0.0015 0.0018 3.3894 7.2395 23.9299 29.0848 67.5864
frequency: 23.7458 29.0683 67.5845 97.5249 118.5685 138.0011 175.0870 181.7976 200.1894 248.1995 263.6582 286.3614 312.8949 349.5912 377.3864 392.4681 400.6184 417.6899 431.0162 472.9775 488.5094 500.9478 544.3234 588.1451 610.3894 636.0777 652.3000 668.0791 683.5206 714.8586 732.0440 753.9253 786.9735 811.1660 827.5448 844.9537 859.3708 910.4261 931.7409 967.7899 974.4822 999.0436 1017.1513 1024.3224 1040.6734 1088.3526 1124.9408 1157.7955 1171.8310 1178.3639 1197.8125 1244.9562 1273.3401 1304.9581 1317.2846 1367.9845 1376.1159 1404.3978 1432.4623 1444.9388 1472.7490 1536.8242 1542.9814 1570.6782 1574.1889 1601.1551 1611.5126 1645.1238 3140.4586 3154.9055 3157.6952 3165.6129 3174.7819 3178.4793 3519.1750
redmass: 10.4452 10.4476 7.7943 6.2752 5.8403 6.2634 9.5082 9.2897 6.8535 6.5969 6.8179 14.6701 8.8521 7.6746 10.6912 7.3419 4.5792 4.7754 4.4950 10.8715 6.3670 4.8772 1.6455 3.4457 4.2677 6.9133 5.3971 4.9397 6.5375 6.9368 2.7550 3.9661 7.6837 1.9406 8.7762 1.4679 3.4265 6.7120 1.7264 4.7538 1.5763 1.3948 1.3675 3.2462 2.1269 2.5592 3.3795 2.3257 1.1550 1.4465 1.8294 1.7627 2.8309 2.6873 2.9600 8.5441 6.0175 10.3712 2.8742 2.7935 2.6839 9.9563 8.0902 8.1244 7.5305 8.3716 7.1258 9.7777 1.0866 1.0903 1.0895 1.0948 1.1004 1.0976 1.0640
irintensity: 0.6914 4.2126 1.7754 0.9001 0.1288 1.0832 2.1930 1.2602 0.9359 0.3107 0.5150 0.8831 5.3519 0.3753 19.3640 9.7306 2.3716 0.3522 5.5633 1.8745 23.7493 1.7389 64.9601 24.0851 64.3517 6.2745 16.7937 2.4347 35.3883 40.6607 38.5579 10.1072 43.4347 33.8784 2.9656 44.7050 6.3680 8.5505 1.0112 38.3576 4.0644 2.7722 1.1602 218.8939 79.0219 1.6839 51.3340 14.3622 2.9164 12.7860 11.8545 14.7056 335.3173 99.2569 125.2948 6.0966 130.5258 1.6039 4.5116 2.8030 6.1849 106.5323 99.2623 99.6989 6.4682 11.2306 5.5396 228.3508 3.4685 4.9653 0.7779 0.6957 26.6855 1.7545 43.1596
temp: 298.150 k
press: 1.00000 atm
elementType: 17 8 8 8 8 6 6 6 6 6 6 6 6 6 6 6 6 6 6 6 1 1 1 1 1 1 1
symmnumber: 1
zpe: 470641.1 jmol-1
zpe.correction: 0.179258 hartree
zpe.thermalcorrener: 0.195153 hartree
zpe.thermalcorrenthalpy: 0.196098 hartree
zpe.thermalcorrgfe: 0.134409 hartree
zpe.sumelectzpe: -1335.410907 hartree
zpe.sumelectthermal: -1335.395011 hartree
zpe.sumelectthermalent: -1335.394067 hartree
zpe.sumelectthermalfe: -1335.455755 hartree
dipole: -1.5932 -0.7400 1.4715
dipole: 2.2916
quadrupole: -93.2487 -127.8299 -125.0514
quadrupole: 10.7926 4.8679 -7.7530
quadrupole: 22.1280 -12.4532 -9.6748 10.7926 4.8679 -7.7530
hfenergy: -1335.5901646 hartree
pointgroup: C01 [X(C15H7Cl1O4)]
dipole: -0.5867396 0.3557439 -0.5848172 debye
polarizability: 266.2419373|-6.2354765|237.5404613|6.6901758|1.8057544|78.3456276 unknown
InChI: InChI=1S/C15H7ClO4/c16-10-6-5-9(15(19)20)11-12(10)14(18)8-4-2-1-3-7(8)13(11)17/h1-6,19H
charge 0 multiplicity 1
27 atoms
Cl 1.002203 -4.086402 0.043072
O  0.300233 2.392943 0.324117
O  -1.552505 -2.766605 -0.075075
O  2.619117 2.341717 -1.299781
O  3.400524 2.337633 0.895391
C  0.835951 0.068612 0.037651
C  0.382314 -1.295221 0.027232
C  -1.582184 0.920169 0.053725
C  -2.040898 -0.423239 -0.02663
C  -0.130851 1.210739 0.138949
C  -1.094772 -1.585394 -0.021981
C  2.220114 0.380361 0.019991
C  1.376036 -2.313854 0.041188
C  -2.5119 1.989864 0.066609
C  -3.432235 -0.682013 -0.097686
C  3.17226 -0.66163 0.055128
C  2.752113 -2.002895 0.068445
C  -3.892647 1.723953 -0.009118
C  -4.352984 0.384423 -0.092365
C  2.753244 1.789962 -0.022125
H  -2.127805 3.012081 0.137138
H  -3.762528 -1.723737 -0.153642
H  4.240017 -0.423428 0.068822
H  3.484629 -2.814205 0.093288
H  -4.6113 2.550017 -0.002703
H  -5.42706 0.178993 -0.149782
H  2.961315 3.276558 -1.28846
