program: Gaussian 09
title: 000235574
version: EM64L-G09RevD.01
frameworkgroup: C1[X(C14H16N2O4S)]
method: RPBEPBE
basis: SDD
operation: Freq
keyword: #p
keyword: freq=noraman
keyword: PBEPBE/SDD
title: #p freq=noraman PBEPBE/SDD
converged: YES YES NO NO
title: Mulliken charges:
elementType: S O O O O N N C C C C C C C C C C C C C C H H H H H H H H H H H H H H H H
charge: 0.980542 -0.267659 -0.564042 -0.502813 -0.537896 -0.526912 -0.687988 0.516083 -0.257160 -0.500147 0.543976 0.461003 -0.379535 -0.368677 -0.458769 -0.367713 0.337700 -0.330693 -0.370933 -0.243743 -0.684817 0.282155 0.302454 0.274171 0.229556 0.228659 0.264140 0.244926 0.249442 0.311251 0.364409 0.205768 0.205758 0.376649 0.206712 0.231751 0.232395
chargesum: 0.00000
title: Mulliken charges with hydrogens summed into heavy atoms:
elementType: S O O O O N N C C C C C C C C C C C C C C
charge: 0.980542 -0.267659 -0.187393 -0.502813 -0.537896 -0.224458 -0.012328 0.516083 -0.257160 -0.217992 0.543976 0.461003 -0.105364 -0.139121 -0.230110 -0.103573 0.337700 -0.085767 -0.121491 0.167783 -0.013959
polarizability: 4.12443438e+02 3.84270870e+00 2.00144496e+02 -5.81063595e+00 -7.09324487e+00 1.26058270e+02
1716.lowfreq: -8.4885 -3.6671 -1.1704 -0.0020 -0.0020 0.0004 16.8298 29.2295 33.6473
frequency: 16.7630 29.2201 33.3264 56.9347 64.6430 104.1957 111.3565 120.3797 123.8514 155.2497 165.8161 169.5902 213.3062 222.9261 241.2687 263.6911 273.7505 293.9582 314.0401 326.7780 342.8080 350.7436 361.1594 399.5144 406.8914 414.2394 424.4608 439.7509 443.9892 480.8854 510.9247 525.5575 536.7959 569.2194 611.4010 635.9325 660.6196 676.5098 706.6683 714.7447 746.0464 787.9819 799.2761 810.9796 818.2918 829.2451 831.0311 840.5546 869.2954 887.6709 903.1980 918.8905 942.3759 950.5623 974.3151 997.0820 1006.0324 1035.8575 1038.7966 1055.1951 1115.3437 1122.8767 1135.6649 1170.7393 1179.7497 1216.8447 1227.4832 1259.5355 1262.5892 1294.8514 1320.5165 1322.4661 1357.8951 1365.9326 1380.9360 1399.3074 1423.8348 1444.2648 1460.3384 1477.3371 1481.4739 1488.7842 1507.7894 1520.3859 1557.2648 1588.4634 1628.8976 1631.8365 1657.5039 2948.0765 2996.7545 3005.0054 3094.0334 3105.4571 3122.6681 3132.3776 3140.2980 3148.0444 3163.5417 3166.5894 3171.0370 3421.8788 3472.3424 3551.7384 3656.7679
redmass: 5.4347 5.1708 5.2050 3.8079 5.1326 5.1145 1.9594 6.8485 3.9034 3.9686 2.7268 2.8423 5.2346 4.6599 1.1851 4.9498 3.7084 5.5393 8.8721 6.6606 5.1180 2.4843 4.0666 5.5235 1.2058 2.9531 2.9876 3.4262 2.3342 3.6693 2.5961 6.1797 7.0777 4.0681 5.0225 6.7781 1.1604 7.2181 3.8601 3.3685 4.0194 3.7778 1.4619 10.9359 1.5927 1.1389 2.2518 2.3494 1.5696 5.8960 3.2173 1.3716 11.7628 1.3446 1.3047 2.6916 2.8025 1.1820 2.8590 1.5538 2.0489 1.3721 1.4354 1.1505 1.2394 2.3482 2.6544 1.1449 1.6360 1.6998 1.6304 1.9986 3.0578 1.9063 3.2508 1.2984 4.2832 4.6638 1.0402 1.1218 1.7104 1.1807 2.3920 3.9570 4.5961 4.8947 1.3621 6.3189 3.8341 1.0552 1.0362 1.1073 1.0989 1.1013 1.0894 1.0889 1.0916 1.0878 1.0940 1.0952 1.0964 1.0566 1.0660 1.0757 1.0941
irintensity: 0.6403 0.7284 1.1658 0.8718 3.5531 6.4947 0.3603 1.8584 1.2637 6.2293 23.5775 19.9337 0.8277 9.2145 0.4672 22.8910 25.8206 9.9681 8.6344 7.2058 8.2851 55.3924 1.1652 12.0955 112.5950 14.1471 28.4050 107.5275 50.4598 38.1573 13.6437 180.2958 75.4959 3.7455 7.7949 0.9372 161.6257 11.3267 3.2706 35.3583 2.9983 24.3985 25.0062 61.4742 106.5781 1.4046 17.1753 23.5832 27.1980 11.5453 54.7645 0.2090 74.2400 1.8717 0.6675 4.2535 15.0455 87.1070 101.3050 2.1091 3.1234 18.7274 4.3135 18.9517 86.6747 306.3773 105.8702 0.0409 8.9521 3.8523 86.0324 1.8952 38.6807 45.2044 64.5051 55.2210 5.7157 14.0991 11.8351 84.6394 7.8632 92.3812 461.0795 551.7679 61.5678 21.6249 217.1605 2.3443 77.9767 49.8643 31.8535 40.0480 31.1493 34.6638 19.9531 15.1991 13.7634 17.9880 21.2365 3.0823 4.0861 114.0439 42.1826 19.4688 62.1580
temp: 298.150 k
press: 1.00000 atm
elementType: 16 8 8 8 8 7 7 6 6 6 6 6 6 6 6 6 6 6 6 6 6 1 1 1 1 1 1 1 1 1 1 1 1 1 1 1 1
symmnumber: 1
zpe: 734830.4 jmol-1
zpe.correction: 0.279882 hartree
zpe.thermalcorrener: 0.301420 hartree
zpe.thermalcorrenthalpy: 0.302364 hartree
zpe.thermalcorrgfe: 0.228021 hartree
zpe.sumelectzpe: -1349.829508 hartree
zpe.sumelectthermal: -1349.807971 hartree
zpe.sumelectthermalent: -1349.807027 hartree
zpe.sumelectthermalfe: -1349.881369 hartree
dipole: -4.0749 1.2788 2.9227
dipole: 5.1751
quadrupole: -123.3758 -115.8986 -140.0118
quadrupole: 16.9102 5.9146 -4.8748
quadrupole: 3.0529 10.5302 -13.5831 16.9102 5.9146 -4.8748
hfenergy: -1350.1093903 hartree
pointgroup: C01 [X(C14H16N2O4S1)]
dipole: -1.5550858 -1.2751836 0.3179936 debye
polarizability: 410.9081217|7.9853544|128.591042|-17.4454743|-15.473835|199.1470405 unknown
InChI: InChI=1S/C14H16N2O4S/c1-2-20-12-6-3-10(4-7-12)16-11-5-8-13(15)14(9-11)21(17,18)19/h3-9,16-17H,2,15H2,1H3
charge 0 multiplicity 1
37 atoms
S  5.049005 0.773765 -1.353883
O  -5.33917 0.292573 0.891315
O  5.407782 -0.763737 -2.361907
O  4.674675 1.96501 -2.381729
O  6.296322 0.974473 -0.320031
N  -0.09119 0.048344 -1.249386
N  4.884445 -0.724064 1.440351
C  1.12896 -0.122331 -0.561516
C  3.552261 0.146941 -0.465885
C  2.327034 0.372655 -1.125034
C  3.684984 -0.533103 0.780792
C  -1.400029 0.079821 -0.700432
C  1.224455 -0.836988 0.67344
C  2.449027 -1.016715 1.32338
C  -2.501503 -0.269586 -1.523304
C  -1.659712 0.50354 0.634627
C  -4.069171 0.200599 0.294915
C  -3.827061 -0.201005 -1.042027
C  -2.975413 0.55201 1.124969
C  -6.509282 -0.050755 0.061807
C  -7.74477 0.142505 0.937063
H  2.319707 0.948021 -2.057709
H  -0.025316 0.173499 -2.260079
H  0.320589 -1.267655 1.114061
H  2.480171 -1.565718 2.271744
H  -2.321233 -0.60526 -2.552021
H  -0.836035 0.827397 1.277821
H  -4.648704 -0.473279 -1.710688
H  -3.180418 0.880776 2.148532
H  4.900775 -1.231379 2.320491
H  5.73773 -0.274152 1.090628
H  -6.539864 0.612112 -0.828218
H  -6.421944 -1.101869 -0.284391
H  6.216249 -0.564344 -2.919459
H  -8.658358 -0.102218 0.365205
H  -7.700096 -0.512897 1.823537
H  -7.8168 1.187915 1.282321
