program: Gaussian 09
title: 000235573
version: EM64L-G09RevD.01
frameworkgroup: C1[X(C14H16N2O3)]
method: RPBEPBE
basis: SDD
operation: Freq
keyword: #p
keyword: freq=noraman
keyword: PBEPBE/SDD
title: #p freq=noraman PBEPBE/SDD
converged: YES YES NO NO
title: Mulliken charges:
elementType: O O O N N C C C C C C C C C C C C C C H H H H H H H H H H H H H H H H
charge: -0.289424 -0.288730 -0.236566 -0.683232 -0.683705 0.189939 0.187612 0.318404 0.319975 -0.320558 -0.320603 -0.253205 -0.253165 -0.387096 -0.387280 -0.254717 -0.254317 -0.212758 -0.212492 0.237414 0.237825 0.235465 0.231856 0.232162 0.235571 0.219482 0.219540 0.226660 0.226646 0.220865 0.220894 0.299828 0.338831 0.299811 0.339069
chargesum: 0.00000
title: Mulliken charges with hydrogens summed into heavy atoms:
elementType: O O O N N C C C C C C C C C C C C C C
charge: -0.289424 -0.288730 -0.236566 -0.044574 -0.044826 0.189939 0.187612 0.318404 0.319975 -0.083144 -0.082778 0.214116 0.214568 -0.167614 -0.167740 -0.028057 -0.027670 0.008107 0.008402
polarizability: 1.73070470e+02 -4.96937678e-01 2.05730488e+02 4.37382872e+01 2.90391466e-01 1.29027055e+02
1716.lowfreq: -0.0006 -0.0005 0.0005 1.6224 6.5866 10.3143 13.6800 17.6707 22.7964
frequency: 10.4675 17.2602 22.6476 43.8480 49.3910 74.7839 121.4103 153.8954 192.9258 215.6690 260.7209 277.9449 306.1001 320.8133 347.8389 352.3554 357.8148 420.2460 431.1859 450.3175 474.7349 487.0890 489.1732 502.2423 504.8841 517.2841 542.0465 566.9633 574.5279 579.8969 590.3653 715.8427 718.0804 733.4096 734.0881 744.4158 746.5899 826.6585 830.3583 833.5715 834.6051 842.4055 879.4788 915.1568 916.2713 945.7970 958.7598 959.3329 984.3125 1006.0450 1007.2032 1038.9324 1039.1743 1079.1537 1117.9618 1120.4413 1141.3418 1165.7493 1166.0915 1169.3414 1169.4875 1250.2301 1269.6003 1270.5678 1287.3469 1326.6655 1327.4554 1372.7646 1392.9522 1393.2657 1394.9450 1439.2614 1447.7551 1450.4941 1458.0873 1501.6945 1502.9496 1585.2444 1585.4417 1603.6041 1604.4310 1633.1104 1633.6435 2992.7568 2996.9613 3119.4551 3119.6733 3134.2845 3134.2968 3135.8684 3138.3491 3144.0446 3144.2237 3168.3170 3168.5156 3551.2689 3552.2507 3703.6368 3704.2699
redmass: 4.6500 5.1124 4.7034 6.0370 4.8993 7.1164 4.5450 3.4093 4.2427 3.0276 4.0951 4.3337 4.0513 3.0914 1.4168 1.2483 2.4599 3.5557 2.8323 4.6806 2.9195 1.5696 1.6598 3.5139 4.8929 1.6579 2.5926 5.6967 6.1765 4.0461 3.9898 4.7178 4.7693 3.8468 4.1452 1.3081 1.2759 4.2810 4.6514 1.5854 1.5760 4.9949 8.0406 1.4173 1.4003 6.9437 1.2984 1.3065 5.6082 1.8643 1.8848 1.8073 1.8057 1.7456 1.6883 1.5982 1.8186 1.9992 1.8869 1.2233 1.2450 1.0705 1.6000 1.6399 1.1148 1.9731 2.0022 1.1622 3.4862 6.5895 1.3787 1.1254 2.0920 2.3970 1.2242 3.3230 3.2599 6.6419 6.6392 1.5892 1.6305 2.7430 2.6131 1.0637 1.0629 1.0866 1.0866 1.0883 1.0887 1.1019 1.1042 1.0943 1.0944 1.1001 1.1001 1.0449 1.0449 1.1038 1.1038
irintensity: 0.1460 0.3648 0.6059 0.0855 0.0556 11.7535 0.3194 1.0663 0.7630 16.1533 0.0057 13.1074 0.0042 42.4071 7.1077 349.3572 2.7073 4.7693 5.9012 0.0792 62.1551 97.4526 11.9417 3.7269 17.1983 7.5299 45.7717 0.0710 3.2354 3.0801 19.7381 2.5442 5.8006 16.4212 3.1267 171.0290 2.0800 105.3974 13.1428 4.3039 0.1105 16.8337 702.0844 7.1669 36.4806 9.3189 0.0932 0.1319 32.4791 5.7770 3.7467 0.3760 13.3717 28.9467 10.2815 112.5977 0.2413 39.0856 67.3104 15.4852 33.9434 4.9978 3.2525 2.2760 2.8331 1.2523 57.2505 1.5907 0.6902 31.1916 4.6200 0.8036 0.1527 9.6013 15.9649 4.8655 201.4751 0.0140 1.8573 11.5193 17.7821 101.5925 355.5987 47.4009 11.9352 10.8978 11.0689 6.8743 2.6895 23.1808 13.5500 52.9501 9.6596 5.3191 27.3325 48.6124 89.9640 43.0154 31.4175
temp: 298.150 k
press: 1.00000 atm
elementType: 8 8 8 7 7 6 6 6 6 6 6 6 6 6 6 6 6 6 6 1 1 1 1 1 1 1 1 1 1 1 1 1 1 1 1
symmnumber: 1
zpe: 731137.1 jmol-1
zpe.correction: 0.278475 hartree
zpe.thermalcorrener: 0.296562 hartree
zpe.thermalcorrenthalpy: 0.297506 hartree
zpe.thermalcorrgfe: 0.228964 hartree
zpe.sumelectzpe: -876.843712 hartree
zpe.sumelectthermal: -876.825626 hartree
zpe.sumelectthermalent: -876.824682 hartree
zpe.sumelectthermalfe: -876.893224 hartree
dipole: 0.0353 -0.7227 -0.0360
dipole: 0.7245
quadrupole: -103.6573 -101.4647 -112.2779
quadrupole: -0.0965 20.1350 0.1828
quadrupole: 2.1427 4.3353 -6.4779 -0.0965 20.1350 0.1828
hfenergy: -877.1221877 hartree
pointgroup: C01 [X(C14H16N2O3)]
dipole: 0.0234111 0.2838511 0.0112117 debye
polarizability: 139.0466388|2.3182735|205.6598874|-47.4326773|1.4312919|163.121487 unknown
InChI: InChI=1S/C14H16N2O3/c15-11-5-1-3-7-13(11)18-9-17-10-19-14-8-4-2-6-12(14)16/h1-8H,9-10,15-16H2
charge 0 multiplicity 1
35 atoms
O  2.063203 1.048749 0.868838
O  -2.028703 1.129146 -0.871969
O  0.033552 2.045229 0.004092
N  3.154283 1.727534 -1.566191
N  -3.038693 1.831243 1.595318
C  2.429367 -0.009956 -0.026086
C  -2.433637 0.080507 0.018401
C  3.030392 0.377198 -1.263476
C  -2.992342 0.480926 1.271368
C  2.2778 -1.361212 0.330554
C  -2.357868 -1.271587 -0.358325
C  0.632503 1.255266 1.077761
C  -0.59092 1.284793 -1.076711
C  3.46999 -0.6582 -2.137423
C  -3.470902 -0.542616 2.138872
C  2.70742 -2.378857 -0.554612
C  -2.825203 -2.278077 0.520387
C  3.304027 -2.014614 -1.78533
C  -3.382061 -1.900646 1.765702
H  1.8393 -1.612331 1.303305
H  -1.948333 -1.529994 -1.341727
H  0.559533 1.871199 1.984139
H  0.11196 0.283639 1.185627
H  -0.105818 0.29551 -1.18985
H  -0.493624 1.903942 -1.978627
H  3.936542 -0.391018 -3.093519
H  -3.906469 -0.265215 3.10662
H  2.59028 -3.431853 -0.280623
H  -2.767256 -3.33184 0.230843
H  3.648389 -2.792563 -2.476179
H  -3.755176 -2.66936 2.451966
H  3.617911 2.037382 -2.413959
H  2.820923 2.410531 -0.88906
H  -3.473964 2.152928 2.453666
H  -2.677103 2.505418 0.923707
