program: Gaussian 09
title: 000235572
version: EM64L-G09RevD.01
frameworkgroup: C1[X(C14H16N2O)]
method: RPBEPBE
basis: SDD
operation: Freq
keyword: #p
keyword: freq=noraman
keyword: PBEPBE/SDD
title: #p freq=noraman PBEPBE/SDD
converged: YES YES NO NO
title: Mulliken charges:
elementType: O N N C C C C C C C C C C C C C C H H H H H H H H H H H H H H H H
charge: -0.272920 -0.696741 -0.704936 -0.589801 0.489138 -0.288597 -0.400197 -0.396660 0.339462 -0.412202 -0.412994 0.479902 -0.324417 -0.360505 0.495470 -0.420914 -0.392538 0.223047 0.223607 0.212596 0.213020 0.228875 0.228874 0.212833 0.212825 0.243479 0.242433 0.210881 0.214037 0.302332 0.302331 0.299104 0.299176
chargesum: 0.00000
title: Mulliken charges with hydrogens summed into heavy atoms:
elementType: O N N C C C C C C C C C C C C C C
charge: -0.272920 -0.092079 -0.106656 -0.143147 0.489138 0.137019 -0.171321 -0.167786 0.339462 -0.199370 -0.200169 0.479902 -0.080938 -0.118072 0.495470 -0.210033 -0.178501
polarizability: 2.62039366e+02 1.80409845e+01 1.42115628e+02 -1.76381224e+00 2.30799875e-01 1.19272478e+02
1716.lowfreq: -14.0793 -0.0006 -0.0001 0.0006 3.6756 4.3363 8.0762 27.7978 34.1454
frequency: -3.2201 27.5282 34.1429 57.4622 106.8832 134.7719 157.7153 173.8184 238.8172 270.6527 294.6184 319.2661 322.5541 328.6432 352.5530 359.8955 385.1837 392.8066 410.2924 413.7246 428.3949 489.6976 512.0469 535.6549 547.1943 636.5248 640.1484 711.8151 723.2797 729.6985 790.4874 792.1793 812.3125 816.9256 819.6707 822.2573 826.3006 843.9899 910.2148 935.3986 938.2779 953.1863 982.3154 995.3275 1001.7681 1003.2327 1015.4222 1038.5402 1068.1345 1125.7908 1129.8972 1174.4333 1175.4285 1187.1332 1208.9088 1219.8059 1274.0225 1292.6035 1303.1670 1311.3609 1312.5620 1319.3789 1367.7377 1385.2256 1387.3771 1433.5241 1437.8891 1471.2130 1486.2766 1511.1075 1521.1984 1582.5136 1586.3650 1632.3498 1632.4765 1644.1237 1647.3607 2944.2786 3001.3572 3002.0882 3063.5155 3107.2168 3108.9566 3118.6748 3122.0976 3129.3038 3136.3161 3157.2938 3162.5205 3569.7185 3575.4354 3710.1903 3716.0611
redmass: 3.7913 3.6547 5.1868 4.3938 5.1101 2.3056 4.8302 5.3541 4.6800 1.2036 2.5544 1.6150 1.0552 2.2295 6.8870 1.0441 3.6721 2.5175 2.7282 2.7808 5.2059 3.7881 2.2449 5.2906 2.9143 6.6638 6.6426 3.3426 3.4164 5.4763 3.7069 1.3081 1.2711 1.3986 1.3854 2.0353 5.7134 4.2348 1.3874 1.4001 1.3441 1.3561 6.8320 2.6520 2.8165 1.5148 1.4338 1.3698 3.8778 1.1943 1.2222 1.1599 1.2420 1.0979 2.5324 2.3422 1.1796 1.4402 1.9287 1.9077 3.2004 1.2577 1.6686 5.4781 3.3740 3.2732 3.5434 1.0968 1.1312 2.6339 3.1201 6.6777 7.2232 1.6798 1.5311 2.1505 3.0819 1.0548 1.0617 1.1042 1.1042 1.0867 1.0867 1.0890 1.0886 1.0963 1.0972 1.0940 1.0952 1.0448 1.0447 1.1040 1.1040
irintensity: 0.3773 0.1787 1.0231 0.8188 1.2804 4.7282 0.0204 3.9023 5.3097 319.8528 4.9855 141.3173 14.7739 168.3602 0.0347 0.6968 6.0886 0.7820 0.0264 0.0130 0.5943 3.8790 22.9831 12.6387 24.5790 0.6775 0.1255 0.3833 1.1176 32.5962 1.6717 13.5723 19.9788 33.7079 31.8870 66.0728 1.0998 27.2771 0.1545 2.5794 0.1704 0.0400 104.2978 25.6253 0.0754 0.1837 0.3575 0.0172 20.0900 20.4139 20.4367 2.1069 37.6490 29.2753 264.5294 76.4285 0.0025 2.5734 5.7829 4.6658 75.7112 0.8420 15.2130 9.9358 32.4565 0.2144 5.1991 19.6646 69.2932 358.2708 108.4638 3.6524 2.3884 21.5488 54.7979 268.3056 107.9636 38.1014 31.5820 24.5538 26.2766 0.4250 41.2977 18.9871 38.7653 50.3096 2.2053 19.5873 3.9460 71.1408 63.0277 19.4580 18.1541
temp: 298.150 k
press: 1.00000 atm
elementType: 8 7 7 6 6 6 6 6 6 6 6 6 6 6 6 6 6 1 1 1 1 1 1 1 1 1 1 1 1 1 1 1 1
symmnumber: 1
zpe: 708715.5 jmol-1
zpe.correction: 0.269935 hartree
zpe.thermalcorrener: 0.285485 hartree
zpe.thermalcorrenthalpy: 0.286429 hartree
zpe.thermalcorrgfe: 0.226423 hartree
zpe.sumelectzpe: -726.583693 hartree
zpe.sumelectthermal: -726.568144 hartree
zpe.sumelectthermalent: -726.567200 hartree
zpe.sumelectthermalfe: -726.627205 hartree
dipole: 1.0975 2.9115 0.0243
dipole: 3.1115
quadrupole: -54.2473 -96.7478 -98.9738
quadrupole: 4.0194 -0.8627 0.2123
quadrupole: 29.0756 -13.4248 -15.6508 4.0194 -0.8627 0.2123
hfenergy: -726.8536286 hartree
pointgroup: C01 [X(C14H16N2O1)]
dipole: -0.3059484 0.6922317 0.9621929 debye
polarizability: 256.8081735|-16.848827|128.8130431|-25.380646|13.31851|137.806255 unknown
InChI: InChI=1S/C14H16N2O/c15-12-3-1-11(2-4-12)9-10-17-14-7-5-13(16)6-8-14/h1-8H,9-10,15-16H2
charge 0 multiplicity 1
33 atoms
O  1.13984 -0.828056 -1.095397
N  -6.020639 1.140957 1.638679
N  6.440179 0.280946 0.576736
C  -1.278166 -0.780421 -1.083158
C  -2.540474 -0.290306 -0.388778
C  -0.012712 -0.318834 -0.339204
C  -3.178775 -1.064023 0.614214
C  -3.100623 0.977377 -0.692076
C  2.426918 -0.507237 -0.609905
C  -4.326106 -0.601236 1.288704
C  -4.247017 1.458584 -0.02949
C  -4.880935 0.673888 0.977267
C  2.687168 0.251944 0.555861
C  3.512465 -0.999965 -1.374103
C  5.117435 0.02528 0.187477
C  4.019958 0.513571 0.946532
C  4.837696 -0.739336 -0.983756
H  -1.224334 -0.400521 -2.12025
H  -1.261517 -1.884369 -1.141752
H  0.00138 -0.721464 0.695511
H  0.025587 0.789593 -0.285451
H  -2.775014 -2.052788 0.86747
H  -2.635136 1.597377 -1.469137
H  -4.80111 -1.226612 2.055119
H  -4.660475 2.440638 -0.291751
H  1.870255 0.645371 1.168473
H  3.297131 -1.586074 -2.273204
H  4.206837 1.103579 1.852492
H  5.665379 -1.130278 -1.58854
H  -6.425653 2.041965 1.404445
H  -6.480545 0.575408 2.345322
H  7.219464 -0.056406 0.021164
H  6.64154 0.836644 1.401586
