program: Gaussian 09
title: 000235571
version: EM64L-G09RevD.01
frameworkgroup: C1[X(C14H15N3)]
method: RPBEPBE
basis: SDD
operation: Freq
keyword: #pfreq=noraman
keyword: PBEPBE/SDD
title: #p freq=noraman PBEPBE/SDD
converged: YES YES NO NO
title: Mulliken charges:
elementType: N N N C C C C C C C C C C C C C C H H H H H H H H H H H H H H H
charge: -0.472618 -0.168910 -0.674288 0.331687 0.108411 0.435634 -0.406139 -0.360207 -0.822553 0.211178 -0.251261 -0.231490 -0.444952 -0.335121 -0.200867 -0.223204 -0.260255 0.226901 0.247576 0.247631 0.227495 0.219764 0.292489 0.222262 0.223551 0.211400 0.320539 0.222501 0.223248 0.225896 0.351002 0.302700
chargesum: 0.00000
title: Mulliken charges with hydrogens summed into heavy atoms:
elementType: N N N C C C C C C C C C C C C C C
charge: -0.180129 -0.168910 -0.020585 0.331687 0.108411 0.435634 -0.179237 -0.112631 -0.127664 0.211178 -0.028999 -0.007939 -0.233552 -0.014583 0.021634 0.000043 -0.034359
polarizability: 2.70330756e+02 4.68158337e+00 1.44688522e+02 8.87365266e+00 2.04748865e+00 1.23264471e+02
1716.lowfreq: -10.6128 -7.9059 -3.7187 -0.0007 0.0007 0.0007 19.2911 33.1357 49.7487
frequency: 17.5647 33.0132 49.7255 62.8473 114.0785 117.3865 132.8603 181.4159 234.4196 249.2187 271.1538 287.5528 313.5260 360.2297 409.7874 441.3243 451.0278 481.8490 499.1113 505.7030 529.1591 543.8324 562.9412 599.9782 614.9728 661.4003 674.5435 697.1801 719.2383 740.8717 762.4009 777.1456 800.0711 838.3245 850.4119 863.2523 912.1825 936.3373 967.9631 974.8568 975.8549 980.9859 985.9356 1001.8405 1025.8538 1039.0451 1043.1834 1049.7113 1084.7621 1112.9674 1167.2974 1169.7332 1184.2602 1198.6252 1236.0206 1270.3415 1275.4032 1312.9457 1340.0152 1362.5820 1391.3041 1396.6310 1428.0277 1436.8847 1458.4589 1472.9682 1478.1022 1486.7220 1531.1752 1572.8099 1595.3637 1605.3840 1614.6441 1619.5476 1665.7892 2969.3298 3044.5359 3084.9914 3101.5214 3114.4374 3126.9133 3128.3169 3140.2943 3144.9336 3161.0863 3162.6406 3181.6360 3537.0951 3547.7677 3679.7760
redmass: 4.0645 4.1163 4.3353 4.4463 4.4229 1.0873 3.9595 3.3863 2.5623 4.3538 2.4753 1.9536 2.8450 4.0190 2.9518 3.1478 3.0880 1.2848 2.5765 2.6539 3.7457 1.5148 5.1928 4.6803 6.2872 8.4332 5.2593 1.9968 3.7021 1.7208 1.6988 2.4122 4.9411 1.3169 4.1251 1.3524 1.4169 1.3787 1.3443 1.4477 2.4829 2.1262 5.4183 1.3092 2.1270 2.0234 1.5303 1.6384 1.5565 1.6473 1.0569 1.0533 1.1162 2.4735 2.4933 3.3426 1.5120 1.6987 1.8492 6.8026 5.2870 1.3142 2.0796 2.4966 1.0574 2.1557 1.3319 2.3021 2.5139 6.4240 3.5678 5.2140 2.2271 2.1381 5.0553 1.0383 1.0951 1.0993 1.0885 1.0867 1.0880 1.0864 1.0931 1.0935 1.1006 1.0993 1.0957 1.0459 1.0745 1.1042
irintensity: 0.1182 1.7505 1.8209 3.8201 1.3954 0.1843 2.3020 4.4185 11.9448 1.6972 25.0283 64.8733 4.0901 7.5488 0.2896 5.6883 35.8414 184.7308 26.5157 7.1210 4.5687 24.2809 0.4853 3.8407 2.7882 10.5487 1.2597 42.5439 6.8303 51.4163 88.3181 40.3876 11.0998 0.4924 5.5376 1.3079 11.1777 1.8311 0.0466 1.6674 8.3699 4.3902 5.9349 2.7869 23.2289 12.1791 4.3589 10.3780 11.5574 18.6394 0.0856 0.3424 1.7285 8.1205 145.4444 1.2315 0.5932 10.9246 60.8896 1.0512 95.4888 20.2307 10.0526 81.1796 22.7522 46.2138 101.7633 41.0915 693.1057 15.8262 239.5346 41.7999 106.1887 22.8162 552.6415 30.3422 18.6557 24.0409 18.7988 11.6585 11.0132 0.4078 34.8013 31.8464 33.5129 23.5191 19.2167 42.6487 18.1536 31.4974
temp: 298.150 k
press: 1.00000 atm
elementType: 7 7 7 6 6 6 6 6 6 6 6 6 6 6 6 6 6 1 1 1 1 1 1 1 1 1 1 1 1 1 1 1
symmnumber: 1
zpe: 681496.5 jmol-1
zpe.correction: 0.259568 hartree
zpe.thermalcorrener: 0.275289 hartree
zpe.thermalcorrenthalpy: 0.276234 hartree
zpe.thermalcorrgfe: 0.214808 hartree
zpe.sumelectzpe: -705.545703 hartree
zpe.sumelectthermal: -705.529982 hartree
zpe.sumelectthermalent: -705.529038 hartree
zpe.sumelectthermalfe: -705.590463 hartree
dipole: 0.3399 3.9774 1.2509
dipole: 4.1833
quadrupole: -93.6602 -87.0942 -101.2556
quadrupole: 1.7547 -0.1657 1.5819
quadrupole: 0.3431 6.9091 -7.2523 1.7547 -0.1657 1.5819
hfenergy: -705.8052716 hartree
pointgroup: C01 [X(C14H15N3)]
dipole: 0.1288146 1.2302302 1.0856935 debye
polarizability: 270.2656588|0.8114828|139.6362182|10.4371271|9.3388754|128.3818728 unknown
InChI: InChI=1S/C14H15N3/c1-11-7-5-6-10-13(11)17-14(15)16-12-8-3-2-4-9-12/h2-10,16H,15H2,1H3
charge 0 multiplicity 1
32 atoms
N  1.410048 1.337219 0.495581
N  -0.524289 0.211779 -0.318527
N  -0.69919 2.180642 1.048453
C  -2.5919 -0.684986 0.729903
C  -1.934708 0.01639 -0.334586
C  2.45575 0.4539 0.116025
C  -3.984129 -0.921375 0.624103
C  -2.686345 0.446773 -1.462277
C  -1.797477 -1.183335 1.922171
C  0.022085 1.17885 0.379666
C  -4.73119 -0.481981 -0.493787
C  -4.074548 0.203242 -1.541736
C  3.785799 0.857664 0.424415
C  2.23841 -0.78568 -0.543776
C  4.878883 0.036543 0.083922
C  3.344994 -1.599341 -0.870832
C  4.666929 -1.202966 -0.56476
H  -4.48861 -1.465125 1.432868
H  -2.157801 0.955484 -2.275944
H  -0.922506 -1.773879 1.592666
H  -1.399263 -0.346943 2.529466
H  -2.420107 -1.812829 2.580825
H  1.720341 2.244337 0.846876
H  -5.807017 -0.681465 -0.549548
H  -4.636985 0.540642 -2.419919
H  3.961773 1.814189 0.935465
H  1.216418 -1.07305 -0.797157
H  5.895554 0.364579 0.328353
H  3.166174 -2.553644 -1.379669
H  5.51593 -1.842463 -0.828555
H  -1.709436 2.196882 0.922431
H  -0.297385 2.726448 1.806984
